{"text_format":"1","workbook":"xlsx","n_sheets":10,"sheets":["Listado","Datos","Rendimientos","Imágenes 2D","Imágenes 3D","Índice sistemas","Tabique sencillo","Tabique doble placa","Tabique triple placa","Tabique mixto"],"not_rendered":{"charts":0,"images":79,"macros":1,"external_links":0,"defined_names":8,"comments":5,"pivot_tables":0},"unopened":[],"bounds":{"document_bytes":16777216,"sheet_cells":100000,"rows_first":2000,"rows_last":500,"rows_between":2000,"halvings":0,"cell_chars":16384,"cell_head_chars":4096},"cells_cut":0,"cells_raw":0,"read":"whole","date_system":"1900"}

{"sheet":"Listado","index":0,"n_rows":54,"n_cols":11,"rows_kept":54,"cut":false,"hidden":true,"merged":[[0,0,1,0],[0,1,0,8],[1,1,1,8]]}
[null,"ELEMENTOS SISTEMA"]
[null,"LISTADO MATRIZ"]
[]
["CÓDIGO ARTÍCULO","DESCRIPCIÓN","COD.ARTICULO","T.M","ALTO","LARGO","UNI.CAJA","CAJAS/PALE","PREC.VENTA "]
["040113","PLACA ATT BASIC 13X600X1200 (78)","040113",3,0.6,1.2,1,78,6.36]
["040115","PLACA ATT BASIC 15X600X1200 (66)","040115",3,0.6,1.2,1,66,7.58]
["040120","PLACA ATT BASIC 20X600X1200 (48)","040120",3,0.6,1.2,1,48,10.76]
["040213","PLACA ATT HIDRO 13X600X1200 (78)","040213",3,0.6,1.2,1,78,11.19]
["040215","PLACA ATT HIDRO 15X600X1200 (66)","040215",3,0.6,1.2,1,66,12.78]
["040220","PLACA ATT HIDRO 20X600X1200 (48)","040220",3,0.6,1.2,1,48,18.22]
["040313","PLACA ATT FUEGO 13X600X1200 (78)","040313",3,0.6,1.2,1,78,9.2100000000000009]
["040315","PLACA ATT FUEGO 15X600X1200 (66)","040315",3,0.6,1.2,1,66,11.57]
["040320","PLACA ATT FUEGO 20X600X1200 (48)","040320",3,0.6,1.2,1,48,18.38]
["040413","PLACA ATT RESIST 13X600X1200 (78)","040413",3,1.2,0.6,1,78,10.71]
["040415","PLACA ATT RESIST 15X600X1200 (66)","040415",3,0.6,1.2,1,66,12.66]
["040420","PLACA ATT RESIST 20X600X1200 (48)","040420",3,0.6,1.2,1,48,20.12]
["040513","PLACA ATT HIDROPLUS 13X600X1200 (78)","040513",3,1.2,0.6,1,78,14.45]
["040515","PLACA ATT HIDROPLUS 15X600X1200 (66)","040515",3,0.6,1.2,1,66,17.09]
["040520","PLACA ATT HIDROPLUS 20X600X1200 (48)","040520",3,0.6,1.2,1,48,26.52]
["040613","PLACA ATT SUPREM 13X600X1200 (78)","040613",3,1.2,0.6,1,78,12.28]
["040615","PLACA ATT SUPREM 15X600X1200 (66)","040615",3,0.6,1.2,1,66,15.46]
["040620","PLACA ATT SUPREM 20X600X1200 (48)","040620",3,0.6,1.2,1,48,22.53]
["0470010110","PASTA ATT JUNTAS 10KG 60 MIN (56)","0470010110",1,0,0,56,1,19.850000000000001]
["0470010210","PASTA ATT JUNTAS 10KG 30 MIN (56)","0470010210",1,0,0,56,1,19.37]
["0470010310","PASTA ATT JUNTAS 10KG 300 MIN (56)","0470010310",1,0,0,56,1,38.65]
["0470010111","PASTA ATT JUNTAS H 10KG 60 MIN (56) ","0470010111",1,0,0,56,1,30.34]
["0470010511","PASTA ATT JUNTAS H 10KG 300 MIN (56) ","0470010511",1,0,0,56,1,45.17]
["48040101","MASILLA PARA ENCUENTROS ATT","48040101",2,0,0,300,12,{"$f":"J28/300","v":2.4199999999999999E-2},7.26,"Precio tarifa"]
["0470010318","PASTA ATT AGARRE 17KG (35)","0470010318",1,0,0,56,1,14.74]
["0470010410","PASTA ATT DE ACABADO 10KG (56)","0470010410",1,0,0,1,84,12.03]
["480903T03","TACO RAPIDO ALTERON 5X30 (100u)","480903T03",1,0,0,1,0,10.53]
["48010348","JUNTA ESTANCA ATT 50MM (30ML)","48010348",1,0,0,21,12,16.59]
["48010370","JUNTA ESTANCA ATT 70MM (30ML)","48010370",1,0,0,14,12,24.06]
["48010390","JUNTA ESTANCA ATT 90MM (30ML)","48010390",1,0,0,10,2,31.63]
["4802010125","TORNILLOS ATT PP 3,5X25 (1000)","4802010125",1,1000,0,1000,0,29.06]
["4802010135","TORNILLOS ATT PP 3,5X35 (1000)","4802010135",1,1000,0,1000,0,33.28]
["4802010145","TORNILLOS ATT PP 3,5X45 (500)","4802010145",1,500,0,500,0,38.64]
["4802010155","TORNILLOS ATT PP 3,5X55 (500)","4802010155",1,500,0,500,0,47.74]
["4802010170","TORNILLOS ATT PP 4,2X70 (500)","4802010170",1,500,0,0,0,58.79]
["48104925","MONTANTE 49X2500 (8u x 16p)","48104925",2,0,2.5,8,16,4.54]
["48104926","MONTANTE 49X2600 (8u x 16p)","48104926",2,0,2.6,8,16,4.54]
["48104927","MONTANTE 49X2700 (8u x 16p)","48104927",2,0,2.7,8,16,4.54]
["48104928","MONTANTE 49X2800 (8u x 16p)","48104928",2,0,2.8,8,16,4.54]
["48104930","MONTANTE 49X3000 (8u x 16p)","48104930",2,0,3,8,16,4.54]
["48104935","MONTANTE 49X3500 (8u x 16p)","48104935",2,0,3.5,8,16,4.54]
["48107426","MONTANTE 74X2600 (8u x 16p)","48107426",2,0,2.6,8,12,5.13]
["48107427","MONTANTE 74X2700 (8u x 16p)","48107427",2,0,2.7,8,12,5.13]
["48107430","MONTANTE 74X3000 (8u x 12p)","48107430",2,0,3,8,12,5.13]
["48109930","MONTANTE 99X3000 (8u x 16p)","48109930",2,0,3,8,8,5.86]
["481110030","CANAL 100X3000 (8u x 16p)","481110030",2,0,3,8,10,5.07]
[48115030,"CANAL 50X3000 (8u x 16p)","48115030",2,0,3,8,16,3.55]
["48117530","CANAL 75X3000 (8u x 15p)","48117530",2,0,3,8,15,4.1399999999999997]
["48127030","MAESTRA ATT 70X3000 (12u x 16p)","48127030",2,0,3,12,63,3.38]
["48128030","MAESTRA ATT 82X3000 (10u x 63p)","48128030",2,0,3,12,42,2.52]

{"sheet":"Datos","index":1,"n_rows":16,"n_cols":3,"rows_kept":16,"cut":false,"hidden":false,"merged":[[15,2,15,5],[10,2,10,5],[11,2,11,5],[12,2,12,5],[13,2,13,5],[14,2,14,5],[0,2,0,5],[1,2,1,5],[5,0,5,1],[8,0,8,1],[9,0,9,1],[4,0,4,1],[4,2,4,5],[5,2,5,5],[6,2,6,5],[7,2,7,5],[8,2,8,5],[9,2,9,5],[15,0,15,1],[13,0,13,1],[7,0,7,1],[6,0,6,1],[0,0,1,0],[10,0,10,1],[11,0,11,1],[12,0,12,1],[14,0,14,1]]}
[null,null,"RENDIMIENTO DE MATERIALES POR M2 DE OBRA"]
[null,null,"DATOS PROGRAMABLES POR USUARIO"]
[]
[]
["CÓDIGO",null,"DESCRIPCIÓN"]
[30,null,"DESCUENTO EN PLACA (%)"]
[30,null,"DESCUENTO EN PERFILERÍA (%)"]
[30,null,"DESCUENTO EN PASTAS (%)"]
[30,null,"DESCUENTO EN TORNILLOS Y FIJACIONES (%)"]
[30,null,"DESCUENTO EN CINTAS Y JUNTAS (%)"]
[20,null,"BENEFICIO PARA PRESUPUESTO(%)"]
["pedidos@elalteron.com",null,"Dirección para envío de pedidos"]
["repuesto@elalteron.com",null,"Dirección para envío de rendimientos "]
["compras@elalteron.com",null,"Dirección para envío de lista de materiales"]
["clientes@elalteron.com",null,"Dirección para envío de presupuestos"]
[30,null,"Precio por hora de la mano de obra (€/h)"]

{"sheet":"Rendimientos","index":2,"n_rows":147,"n_cols":6,"rows_kept":147,"cut":false,"hidden":true,"merged":[[0,0,1,0],[0,2,0,5],[1,2,1,5]]}
[null,null,"RENDIMIENTO DE MATERIALES POR M2 DE OBRA"]
[null,null,"CUBICACIONES PARA TRASDOSADO "]
[]
[]
["CODIGO",null,"MATERIALES","UD","CANTIDAD por m2","PIEZA"]
[null,null,"PLACA","m2",1.02]
[null,null,"CANAL","m",0.8]
[null,null,"MONTANTE (modulación 400)","m",3]
[null,null,"MONTANTE (modulación 600) ","m",2.1]
[null,null,"TORNILLO PP (modulación 400) TRASDOSADO SIMPLE","ud",18,1000]
[null,null,"TORNILLO PP (modulación 400) TRASDOSADO DOBLE 1ª CAPA","ud",18,1000]
[null,null,"TORNILLO PP (modulación 400) TRASDOSADO DOBLE 2ª CAPA","ud",{"$f":"E10","v":18},1000]
[null,null,"TORNILLO PP (modulación 400) TRASDOSADO TRIPLE 1ª CAPA","ud",18,500]
[null,null,"TORNILLO PP (modulación 400) TRASDOSADO TRIPLE 2ª CAPA","ud",18,1000]
[null,null,"TORNILLO PP (modulación 400) TRASDOSADO TRIPLE 3ª CAPA","ud",{"$f":"E10","v":18},500]
[null,null,"TORNILLO PP (modulación 600) TRASDOSADO SIMPLE","ud",14,1000]
[null,null,"TORNILLO PP (modulación 600) TRASDOSADO DOBLE 1ª CAPA","ud",14,1000]
[null,null,"TORNILLO PP (modulación 600) TRASDOSADO DOBLE 2ª CAPA","ud",{"$f":"E16","v":14},1000]
[null,null,"TORNILLO PP (modulación 600) TRASDOSADO TRIPLE 1ª CAPA","ud",14,1000]
[null,null,"TORNILLO PP (modulación 600) TRASDOSADO TRIPLE 2ª CAPA","ud",14,1000]
[null,null,"TORNILLO PP (modulación 600) TRASDOSADO TRIPLE 3ª CAPA","ud",{"$f":"E16","v":14},500]
["480903T03",null,{"$f":"VLOOKUP(A22,Listado!$A$5:$B$54,2,FALSE)","v":"TACO RAPIDO ALTERON 5X30 (100u)"},"ud",2,100]
["48040101",null,"MASILLA PARA ENCUENTROS ATT","mil",10,300]
["48010348",null,{"$f":"VLOOKUP(A24,Listado!$A$5:$B$54,2,FALSE)","v":"JUNTA ESTANCA ATT 50MM (30ML)"},"m",{"$f":"E7","v":0.8},30]
[null,"Q2","Totalmente finalizado con nivel de acabado Q2","kg",0.11,10]
["0470010410","Q3","Totalmente finalizado con nivel de acabado Q3","kg",7.0000000000000007E-2,10]
["0470010410","Q4","Totalmente finalizado con nivel de acabado Q4","kg",0.22500000000000001,10]
["MODULACIÓN",null,600]
["MODULACIÓN",null,400]
[null,42,"Mano de obra tabique sencillo (modulación 400, Q2)","€/m2",{"$f":"F30*Datos!$A$16","v":9},0.3]
[null,43,"Mano de obra tabique sencillo (modulación 400, Q3)","€/m2",{"$f":"F31*Datos!$A$16","v":10.200000000000001},0.34]
[null,44,"Mano de obra tabique sencillo (modulación 400, Q4)","€/m2",{"$f":"F32*Datos!$A$16","v":14.399999999999999},0.48]
[null,62,"Mano de obra tabique sencillo (modulación 600, Q2)","€/m2",{"$f":"F33*Datos!$A$16","v":7.5},0.25]
[null,63,"Mano de obra tabique sencillo (modulación 600, Q3)","€/m2",{"$f":"F34*Datos!$A$16","v":8.6999999999999993},0.28999999999999998]
[null,64,"Mano de obra tabique sencillo (modulación 600, Q4)","€/m2",{"$f":"F35*Datos!$A$16","v":12.9},0.43]
[null,42,"Mano de obra tabique doble placa (modulación 400, Q2)","€/m2",{"$f":"A36*Rendimientos!E23","v":0},0.42]
[null,43,"Mano de obra tabique doble placa (modulación 400, Q3)","€/m2",{"$f":"F37*Datos!$A$16","v":13.799999999999999},0.45999999999999996]
[null,44,"Mano de obra tabique doble placa (modulación 400, Q4)","€/m2",{"$f":"F38*Datos!$A$16","v":18},0.6]
[null,62,"Mano de obra tabique doble placa (modulación 600, Q2)","€/m2",{"$f":"F39*Datos!$A$16","v":11.1},0.37]
[null,63,"Mano de obra tabique doble placa (modulación 600, Q3)","€/m2",{"$f":"F40*Datos!$A$16","v":12.299999999999999},0.41]
[null,64,"Mano de obra tabique doble placa (modulación 600, Q4)","€/m2",{"$f":"F41*Datos!$A$16","v":16.5},0.55000000000000004]
[null,42,"Mano de obra tabique triple placa (modulación 400, Q2)","€/m2",{"$f":"F42*Datos!$A$16","v":16.200000000000003},0.54]
[null,43,"Mano de obra tabique triple placa (modulación 400, Q3)","€/m2",{"$f":"F43*Datos!$A$16","v":17.399999999999999},0.57999999999999996]
[null,44,"Mano de obra tabique triple placa (modulación 400, Q4)","€/m2",{"$f":"F44*Datos!$A$16","v":21.599999999999998},0.72]
[null,62,"Mano de obra tabique triple placa (modulación 600, Q2)","€/m2",{"$f":"F45*Datos!$A$16","v":14.7},0.49]
[null,63,"Mano de obra tabique triple placa (modulación 600, Q3)","€/m2",{"$f":"F46*Datos!$A$16","v":15.9},0.53]
[null,64,"Mano de obra tabique triple placa (modulación 600, Q4)","€/m2",{"$f":"F47*Datos!$A$16","v":20.100000000000001},0.67]
[null,null,"Mano de obra tabique doble estructura sencillo (modulación 400, Q2)","€/m2",{"$f":"F48*Datos!$A$16","v":0}]
[null,null,"Mano de obra tabique doble estructura sencillo (modulación 400, Q3)","€/m2",{"$f":"F49*Datos!$A$16","v":0}]
[null,null,"Mano de obra tabique doble estructura sencillo (modulación 400, Q4)","€/m2",{"$f":"F50*Datos!$A$16","v":0}]
[null,null,"Mano de obra tabique doble estructura sencillo (modulación 600, Q2)","€/m2",{"$f":"F51*Datos!$A$16","v":0}]
[null,null,"Mano de obra tabique doble estructura sencillo (modulación 600, Q3)","€/m2",{"$f":"F52*Datos!$A$16","v":0}]
[null,null,"Mano de obra tabique doble estructura sencillo (modulación 600, Q4)","€/m2",{"$f":"F53*Datos!$A$16","v":0}]
[null,null,"Mano de obra tabique doble estructura doble placa (modulación 400, Q2)","€/m2",{"$f":"F54*Datos!$A$16","v":0}]
[null,null,"Mano de obra tabique doble estructura doble placa (modulación 400, Q3)","€/m2",{"$f":"F55*Datos!$A$16","v":0}]
[null,null,"Mano de obra tabique doble estructura doble placa (modulación 400, Q4)","€/m2",{"$f":"F56*Datos!$A$16","v":0}]
[null,null,"Mano de obra tabique doble estructura doble placa (modulación 600, Q2)","€/m2",{"$f":"F57*Datos!$A$16","v":0}]
[null,null,"Mano de obra tabique doble estructura doble placa (modulación 600, Q3)","€/m2",{"$f":"F58*Datos!$A$16","v":0}]
[null,null,"Mano de obra tabique doble estructura doble placa (modulación 600, Q4)","€/m2",{"$f":"F59*Datos!$A$16","v":0}]
[null,null,"Mano de obra tabique doble estructura triple placa (modulación 400, Q2)","€/m2",{"$f":"F60*Datos!$A$16","v":0}]
[null,null,"Mano de obra tabique doble estructura triple placa (modulación 400, Q3)","€/m2",{"$f":"F61*Datos!$A$16","v":0}]
[null,null,"Mano de obra tabique doble estructura triple placa (modulación 400, Q4)","€/m2",{"$f":"F62*Datos!$A$16","v":0}]
[null,null,"Mano de obra tabique doble estructura triple placa (modulación 600, Q2)","€/m2",{"$f":"F63*Datos!$A$16","v":0}]
[null,null,"Mano de obra tabique doble estructura triple placa (modulación 600, Q3)","€/m2",{"$f":"F64*Datos!$A$16","v":0}]
[null,null,"Mano de obra tabique doble estructura triple placa (modulación 600, Q4)","€/m2",{"$f":"F65*Datos!$A$16","v":0}]
[null,null,"Mano de obra tabique doble estructura arriostrado sencillo (modulación 400, Q2)","€/m2",{"$f":"F66*Datos!$A$16","v":0}]
[null,null,"Mano de obra tabique doble estructura arriostrado sencillo (modulación 400, Q3)","€/m2",{"$f":"F67*Datos!$A$16","v":0}]
[null,null,"Mano de obra tabique doble estructura arriostrado sencillo (modulación 400, Q4)","€/m2",{"$f":"F68*Datos!$A$16","v":0}]
[null,null,"Mano de obra tabique doble estructura arriostrado sencillo (modulación 600, Q2)","€/m2",{"$f":"F69*Datos!$A$16","v":0}]
[null,null,"Mano de obra tabique doble estructura arriostrado sencillo (modulación 600, Q3)","€/m2",{"$f":"F70*Datos!$A$16","v":0}]
[null,null,"Mano de obra tabique doble estructura arriostrado sencillo (modulación 600, Q4)","€/m2",{"$f":"F71*Datos!$A$16","v":0}]
[null,null,"Mano de obra tabique doble estructura arriostrado doble placa (modulación 400, Q2)","€/m2",{"$f":"F72*Datos!$A$16","v":0}]
[null,null,"Mano de obra tabique doble estructura arriostrado doble placa (modulación 400, Q3)","€/m2",{"$f":"F73*Datos!$A$16","v":0}]
[null,null,"Mano de obra tabique doble estructura arriostrado doble placa (modulación 400, Q4)","€/m2",{"$f":"F74*Datos!$A$16","v":0}]
[null,null,"Mano de obra tabique doble estructura arriostrado doble placa (modulación 600, Q2)","€/m2",{"$f":"F75*Datos!$A$16","v":0}]
[null,null,"Mano de obra tabique doble estructura arriostrado doble placa (modulación 600, Q3)","€/m2",{"$f":"F76*Datos!$A$16","v":0}]
[null,null,"Mano de obra tabique doble estructura arriostrado doble placa (modulación 600, Q4)","€/m2",{"$f":"F77*Datos!$A$16","v":0}]
[null,null,"Mano de obra tabique doble estructura arriostrado triple placa (modulación 400, Q2)","€/m2",{"$f":"F78*Datos!$A$16","v":0}]
[null,null,"Mano de obra tabique doble estructura arriostrado triple placa (modulación 400, Q3)","€/m2",{"$f":"F79*Datos!$A$16","v":0}]
[null,null,"Mano de obra tabique doble estructura arriostrado triple placa (modulación 400, Q4)","€/m2",{"$f":"F80*Datos!$A$16","v":0}]
[null,null,"Mano de obra tabique doble estructura arriostrado triple placa (modulación 600, Q2)","€/m2",{"$f":"F81*Datos!$A$16","v":0}]
[null,null,"Mano de obra tabique doble estructura arriostrado triple placa (modulación 600, Q3)","€/m2",{"$f":"F82*Datos!$A$16","v":0}]
[null,null,"Mano de obra tabique doble estructura arriostrado triple placa (modulación 600, Q4)","€/m2",{"$f":"F83*Datos!$A$16","v":0}]
[null,null,"Mano de obra tabique especial sencillo (modulación 400, Q2)","€/m2",{"$f":"F84*Datos!$A$16","v":0}]
[null,null,"Mano de obra tabique especial sencillo (modulación 400, Q3)","€/m2",{"$f":"F85*Datos!$A$16","v":0}]
[null,null,"Mano de obra tabique especial sencillo (modulación 400, Q4)","€/m2",{"$f":"F86*Datos!$A$16","v":0}]
[null,null,"Mano de obra tabique especial sencillo (modulación 600, Q2)","€/m2",{"$f":"F87*Datos!$A$16","v":0}]
[null,null,"Mano de obra tabique especial sencillo (modulación 600, Q3)","€/m2",{"$f":"F88*Datos!$A$16","v":0}]
[null,null,"Mano de obra tabique especial sencillo (modulación 600, Q4)","€/m2",{"$f":"F89*Datos!$A$16","v":0}]
[null,null,"Mano de obra tabique especial doble placa (modulación 400, Q2)","€/m2",{"$f":"F90*Datos!$A$16","v":0}]
[null,null,"Mano de obra tabique especial doble placa (modulación 400, Q3)","€/m2",{"$f":"F91*Datos!$A$16","v":0}]
[null,null,"Mano de obra tabique especial doble placa (modulación 400, Q4)","€/m2",{"$f":"F92*Datos!$A$16","v":0}]
[null,null,"Mano de obra tabique especial doble placa (modulación 600, Q2)","€/m2",{"$f":"F93*Datos!$A$16","v":0}]
[null,null,"Mano de obra tabique especial doble placa (modulación 600, Q3)","€/m2",{"$f":"F94*Datos!$A$16","v":0}]
[null,null,"Mano de obra tabique especial doble placa (modulación 600, Q4)","€/m2",{"$f":"F95*Datos!$A$16","v":0}]
[null,null,"Mano de obra tabique especial triple placa (modulación 400, Q2)","€/m2",{"$f":"F96*Datos!$A$16","v":0}]
[null,null,"Mano de obra tabique especial triple placa (modulación 400, Q3)","€/m2",{"$f":"F97*Datos!$A$16","v":0}]
[null,null,"Mano de obra tabique especial triple placa (modulación 400, Q4)","€/m2",{"$f":"F98*Datos!$A$16","v":0}]
[null,null,"Mano de obra tabique especial triple placa (modulación 600, Q2)","€/m2",{"$f":"F99*Datos!$A$16","v":0}]
[null,null,"Mano de obra tabique especial triple placa (modulación 600, Q3)","€/m2",{"$f":"F100*Datos!$A$16","v":0}]
[null,null,"Mano de obra tabique especial triple placa (modulación 600, Q4)","€/m2",{"$f":"F101*Datos!$A$16","v":0}]
[null,42,"Mano de obra trasdosado sencillo (modulación 400, Q2)","€/m2",{"$f":"F102*Datos!$A$16","v":8.6999999999999975},0.28999999999999992]
[null,43,"Mano de obra trasdosado sencillo (modulación 400, Q3)","€/m2",{"$f":"F103*Datos!$A$16","v":9.2999999999999989},0.30999999999999994]
[null,44,"Mano de obra trasdosado sencillo (modulación 400, Q4)","€/m2",{"$f":"F104*Datos!$A$16","v":11.399999999999997},0.37999999999999989]
[null,62,"Mano de obra trasdosado sencillo (modulación 600, Q2)","€/m2",{"$f":"F105*Datos!$A$16","v":7.1999999999999993},0.23999999999999996]
[null,63,"Mano de obra trasdosado sencillo (modulación 600, Q3)","€/m2",{"$f":"F106*Datos!$A$16","v":7.7999999999999989},0.25999999999999995]
[null,64,"Mano de obra trasdosado sencillo (modulación 600, Q4)","€/m2",{"$f":"F107*Datos!$A$16","v":9.8999999999999986},0.32999999999999996]
[null,42,"Mano de obra trasdosado doble placa (modulación 400, Q2)","€/m2",{"$f":"F108*Datos!$A$16","v":10.499999999999998},0.34999999999999992]
[null,43,"Mano de obra trasdosado doble placa (modulación 400, Q3)","€/m2",{"$f":"F109*Datos!$A$16","v":11.099999999999998},0.36999999999999994]
[null,44,"Mano de obra trasdosado doble placa (modulación 400, Q4)","€/m2",{"$f":"F110*Datos!$A$16","v":13.2},0.43999999999999995]
[null,62,"Mano de obra trasdosado doble placa (modulación 600, Q2)","€/m2",{"$f":"F111*Datos!$A$16","v":8.9999999999999982},0.29999999999999993]
[null,63,"Mano de obra trasdosado doble placa (modulación 600, Q3)","€/m2",{"$f":"F112*Datos!$A$16","v":9.5999999999999979},0.31999999999999995]
[null,64,"Mano de obra trasdosado doble placa (modulación 600, Q4)","€/m2",{"$f":"F113*Datos!$A$16","v":11.699999999999998},0.3899999999999999]
[null,42,"Mano de obra trasdosado triple placa (modulación 400, Q2)","€/m2",{"$f":"F114*Datos!$A$16","v":12.299999999999997},0.40999999999999992]
[null,43,"Mano de obra trasdosado triple placa (modulación 400, Q3)","€/m2",{"$f":"F115*Datos!$A$16","v":12.899999999999999},0.42999999999999994]
[null,44,"Mano de obra trasdosado triple placa (modulación 400, Q4)","€/m2",{"$f":"F116*Datos!$A$16","v":14.999999999999996},0.49999999999999989]
[null,62,"Mano de obra trasdosado triple placa (modulación 600, Q2)","€/m2",{"$f":"F117*Datos!$A$16","v":10.799999999999997},0.35999999999999993]
[null,63,"Mano de obra trasdosado triple placa (modulación 600, Q3)","€/m2",{"$f":"F118*Datos!$A$16","v":11.399999999999999},0.37999999999999995]
[null,64,"Mano de obra trasdosado triple placa (modulación 600, Q4)","€/m2",{"$f":"F119*Datos!$A$16","v":13.499999999999998},0.44999999999999996]
[null,42,"Mano de obra trasdosado semidirecto sencillo (modulación 400, Q2)","€/m2",{"$f":"F120*Datos!$A$16","v":4.8},0.16]
[null,43,"Mano de obra trasdosado semidirecto sencillo (modulación 400, Q3)","€/m2",{"$f":"F121*Datos!$A$16","v":6},0.2]
[null,44,"Mano de obra trasdosado semidirecto sencillo (modulación 400, Q4)","€/m2",{"$f":"F122*Datos!$A$16","v":10.200000000000001},0.34]
[null,62,"Mano de obra trasdosado semidirecto sencillo (modulación 600, Q2)","€/m2",{"$f":"F123*Datos!$A$16","v":3.3},0.11]
[null,63,"Mano de obra trasdosado semidirecto sencillo (modulación 600, Q3)","€/m2",{"$f":"F124*Datos!$A$16","v":4.5},0.15]
[null,64,"Mano de obra trasdosado semidirecto sencillo (modulación 600, Q4)","€/m2",{"$f":"F125*Datos!$A$16","v":8.6999999999999993},0.28999999999999998]
[null,42,"Mano de obra trasdosado semidirecto doble placa (modulación 400, Q2)","€/m2",{"$f":"F126*Datos!$A$16","v":8.4},0.28000000000000003]
[null,43,"Mano de obra trasdosado semidirecto doble placa (modulación 400, Q3)","€/m2",{"$f":"F127*Datos!$A$16","v":9.6},0.32]
[null,44,"Mano de obra trasdosado semidirecto doble placa (modulación 400, Q4)","€/m2",{"$f":"F128*Datos!$A$16","v":13.8},0.46]
[null,62,"Mano de obra trasdosado semidirecto doble placa (modulación 600, Q2)","€/m2",{"$f":"F129*Datos!$A$16","v":6.9},0.23]
[null,63,"Mano de obra trasdosado semidirecto doble placa (modulación 600, Q3)","€/m2",{"$f":"F130*Datos!$A$16","v":8.1000000000000014},0.27]
[null,64,"Mano de obra trasdosado semidirecto doble placa (modulación 600, Q4)","€/m2",{"$f":"F131*Datos!$A$16","v":12.299999999999999},0.41]
[null,42,"Mano de obra trasdosado semidirecto triple placa (modulación 400, Q2)","€/m2",{"$f":"F132*Datos!$A$16","v":12},0.4]
[null,43,"Mano de obra trasdosado semidirecto triple placa (modulación 400, Q3)","€/m2",{"$f":"F133*Datos!$A$16","v":13.2},0.44]
[null,44,"Mano de obra trasdosado semidirecto triple placa (modulación 400, Q4)","€/m2",{"$f":"F134*Datos!$A$16","v":17.399999999999999},0.57999999999999996]
[null,62,"Mano de obra trasdosado semidirecto triple placa (modulación 600, Q2)","€/m2",{"$f":"F135*Datos!$A$16","v":10.5},0.35]
[null,63,"Mano de obra trasdosado semidirecto triple placa (modulación 600, Q3)","€/m2",{"$f":"F136*Datos!$A$16","v":11.700000000000001},0.39]
[null,64,"Mano de obra trasdosado semidirecto triple placa (modulación 600, Q4)","€/m2",{"$f":"F137*Datos!$A$16","v":15.9},0.53]
[null,2,"Mano de obra trasdosado directo sencillo (Q2)","€/m2",{"$f":"F138*Datos!$A$16","v":4.8},0.16]
[null,3,"Mano de obra trasdosado directo sencillo (Q3)","€/m2",{"$f":"F139*Datos!$A$16","v":6},0.2]
[null,4,"Mano de obra trasdosado directo sencillo (Q4)","€/m2",{"$f":"F140*Datos!$A$16","v":10.200000000000001},0.34]
[null,null,"NOTA: Rendimientos calculados teniendo en cuenta un despedicio del 2% en las placas y del 5% en el resto del sistema."]
[null,null,"MAESTRA (modulación 400)","m",2.96]
[null,null,"MAESTRA (modulación 600) ","m",2.15]
[null,null,"BANDA ESTANCA (modulación 400)","m",{"$f":"E142","v":2.96}]
[null,null,"BANDA ESTANCA (modulación 600) ","m",{"$f":"E143","v":2.15}]
[null,null,"TACO RÁPIDO (modulación 400)","m",8.44]
[null,null,"TACO RÁPIDO (modulación 600) ","m",6.11]

{"sheet":"Imágenes 2D","index":3,"n_rows":6,"n_cols":21,"rows_kept":6,"cut":false,"hidden":true,"merged":[]}
[]
[null,1,2,3,4,5,6,null,1,2,3,4,5,6,null,1,2,3,4,5,6]
["Tabique sencillo",null,null,null,null,null,null,"Tabique doble placa",null,null,null,null,null,null,"Tabique triple placa"]
[]
[null,2,3,4,5,6]
["Tabique mixto"]

{"sheet":"Imágenes 3D","index":4,"n_rows":6,"n_cols":21,"rows_kept":6,"cut":false,"hidden":true,"merged":[]}
[]
[null,1,2,3,4,5,6,null,1,2,3,4,5,6,null,1,2,3,4,5,6]
["Tabique sencillo",null,null,null,null,null,null,"Tabique doble placa",null,null,null,null,null,null,"Tabique triple placa"]
[]
[null,2,3,4,5,6]
["Tabique sencillo"]

{"sheet":"Índice sistemas","index":5,"n_rows":76,"n_cols":14,"rows_kept":76,"cut":false,"hidden":false,"merged":[[0,0,2,1],[18,0,24,0],[4,0,10,0],[11,0,17,0],[25,0,31,0],[25,1,31,1],[18,1,24,1],[11,1,17,1],[4,1,10,1]]}
[]
[]
[]
[null,"TABIQUE SIMPLE ESTRUCTURA ","CÓDIGO","ID","SISTEMAS","M","M","P","Descripción Basic","Descripción Hidro","Descripción Fuego","Descripción Resist","Descripción Hidroplus","Descripción Suprem"]
["PLACA SIMPLE",null,{"$f":"F5*100+G5*100+H5*2","v":64926},"1.1.1","TABIQUE ATT® 75/600 (49)  [13+49+13]",600,49,13,"Tabique formado por una placa BASIC de 13 mm de espesor compuesta por yeso natural, fibra de vidrio y aditivos inorgánicos que le aportan alta dureza y resistencia mecánica. Reacción al fuego: EUROCLASE A1. Sistema de galces desiguales: las placas encajan entre ellas dejando una entrecalle de 3 mm por donde se inserta la pasta de juntas. Este sistema no utiliza cinta de papel. La pasta de juntas se aplica en las cavidades de las placas y una masilla elástica en los encuentros. Atornillada a cada lado de una estructura metálica de acero galvanizado formada por canales de 50 mm y montantes de 51x49x49 mm con una modulación de 600 mm entre ejes, dando un ancho total de tabique de 75 mm. Incluida parte proporcional del resto de materiales: tornillería, pasta de juntas, masilla para encuentros perimetrales, fijaciones, junta estanca, etc. Montaje según norma de instalación UNE 102043 y exigencias del CTE.","Tabique formado por una placa HIDRO de 13 mm de espesor compuesta por yeso natural, fibra de vidrio y aditivos inorgánicos que le aportan alta dureza y resistencia mecánica. Incorpora tratamiento hidrófugo, disminuyendo así su capacidad de absorción de agua (menor al 5%). Idónea para proteger las estancias de los efectos adversos de la humedad. Reacción al fuego: EUROCLASE A1. Sistema de galces desiguales: las placas encajan entre ellas dejando una entrecalle de 3 mm por donde se inserta la pasta de juntas. Este sistema no utiliza cinta de papel. La pasta de juntas se aplica en las cavidades de las placas y una masilla elástica en los encuentros. Atornillada a cada lado de una estructura metálica de acero galvanizado formada por canales de 50 mm y montantes de 51x49x49 mm con una modulación de 600 mm entre ejes, dando un ancho total de tabique de 75 mm. Incluida parte proporcional del resto de materiales: tornillería, pasta de juntas, masilla para encuentros perimetrales, fijaciones, junta estanca, etc. Montaje según norma de instalación UNE 102043 y exigencias del CTE.","Tabique formado por una placa FUEGO de 13 mm de espesor compuesta por yeso natural, fibra de vidrio y aditivos inorgánicos que le aportan alta dureza y resistencia mecánica. Incorpora perlita y un aumento en la densidad que la hace idónea para un excelente comportamiento y resistencia frente al fuego. Reacción al fuego: EUROCLASE A1. Sistema de galces desiguales: las placas encajan entre ellas dejando una entrecalle de 3 mm por donde se inserta la pasta de juntas. Este sistema no utiliza cinta de papel. La pasta de juntas se aplica en las cavidades de las placas y una masilla elástica en los encuentros. Atornillada a cada lado de una estructura metálica de acero galvanizado formada por canales de 50 mm y montantes de 51x49x49 mm con una modulación de 600 mm entre ejes, dando un ancho total de tabique de 75 mm. Incluida parte proporcional del resto de materiales: tornillería, pasta de juntas, masilla para encuentros perimetrales, fijaciones, junta estanca, etc. Montaje según norma de instalación UNE 102043 y exigencias del CTE.","Tabique formado por una placa RESIST de 13 mm de espesor compuesta por yeso natural, fibra de vidrio y aditivos inorgánicos que le aportan alta dureza y resistencia mecánica. Con mayor cantidad de fibra de vidrio y dosificación modificada, aumenta su densidad, mejorando notablemente la resistencia mecánica. Idónea para lugares con altas exigencias en cuanto a deterioro y desgaste. Reacción al fuego: EUROCLASE A1. Sistema de galces desiguales: las placas encajan entre ellas dejando una entrecalle de 3 mm por donde se inserta la pasta de juntas. Este sistema no utiliza cinta de papel. La pasta de juntas se aplica en las cavidades de las placas y una masilla elástica en los encuentros. Atornillada a cada lado de una estructura metálica de acero galvanizado formada por canales de 50 mm y montantes de 51x49x49 mm con una modulación de 600 mm entre ejes, dando un ancho total de tabique de 75 mm. Incluida parte proporcional del resto de materiales: tornillería, pasta de juntas, masilla para encuentros perimetrales, fijaciones, junta estanca, etc. Montaje según norma de instalación UNE 102043 y exigencias del CTE.","Tabique formado por una placa HIDROPLUS de 13 mm de espesor compuesta por yeso natural, fibra de vidrio y aditivos inorgánicos que le aportan alta dureza y resistencia mecánica. Incorpora tratamiento hidrófugo y un aumento en su densidad, características claves para una elevada resistencia a la humedad (absorción de agua menor al 3%) y una gran resistencia mecánica. Idónea para zonas de intemperie. Reacción al fuego: EUROCLASE A1. Sistema de galces desiguales: las placas encajan entre ellas dejando una entrecalle de 3 mm por donde se inserta la pasta de juntas. Este sistema no utiliza cinta de papel. La pasta de juntas se aplica en las cavidades de las placas y una masilla elástica en los encuentros. Atornillada a cada lado de una estructura metálica de acero galvanizado formada por canales de 50 mm y montantes de 51x49x49 mm con una modulación de 600 mm entre ejes, dando un ancho total de tabique de 75 mm. Incluida parte proporcional del resto de materiales: tornillería, pasta de juntas, masilla para encuentros perimetrales, fijaciones, junta estanca, etc. Montaje según norma de instalación UNE 102043 y exigencias del CTE.","Tabique formado por una placa SUPREM de 13 mm de espesor compuesta por yeso natural, fibra de vidrio y aditivos inorgánicos que le aportan alta dureza y resistencia mecánica. Incorpora tratamiento hidrófugo, perlita y un aumento en la densidad para conseguir soluciones constructivas que cumplan, altos requisitos frente al fuego y una capacidad reducida de absorción de agua. Reacción al fuego: EUROCLASE A1. Sistema de galces desiguales: las placas encajan entre ellas dejando una entrecalle de 3 mm por donde se inserta la pasta de juntas. Este sistema no utiliza cinta de papel. La pasta de juntas se aplica en las cavidades de las placas y una masilla elástica en los encuentros. Atornillada a cada lado de una estructura metálica de acero galvanizado formada por canales de 50 mm y montantes de 51x49x49 mm con una modulación de 600 mm entre ejes, dando un ancho total de tabique de 75 mm. Incluida parte proporcional del resto de materiales: tornillería, pasta de juntas, masilla para encuentros perimetrales, fijaciones, junta estanca, etc. Montaje según norma de instalación UNE 102043 y exigencias del CTE."]
[null,null,{"$f":"F6*100+G6*100+H6*2","v":64930},"1.1.2","TABIQUE ATT® 79/600 (49)  [15+49+15]",600,49,15,"Tabique formado por una placa BASIC de 15 mm de espesor compuesta por yeso natural, fibra de vidrio y aditivos inorgánicos que le aportan alta dureza y resistencia mecánica. Reacción al fuego: EUROCLASE A1. Sistema de galces desiguales: las placas encajan entre ellas dejando una entrecalle de 3 mm por donde se inserta la pasta de juntas. Este sistema no utiliza cinta de papel. La pasta de juntas se aplica en las cavidades de las placas y una masilla elástica en los encuentros. Atornillada a cada lado de una estructura metálica de acero galvanizado formada por canales de 50 mm y montantes de 51x49x49 mm con una modulación de 600 mm entre ejes, dando un ancho total de tabique de 79 mm. Incluida parte proporcional del resto de materiales: tornillería, pasta de juntas, masilla para encuentros perimetrales, fijaciones, junta estanca, etc. Montaje según norma de instalación UNE 102043 y exigencias del CTE.","Tabique formado por una placa HIDRO de 15 mm de espesor compuesta por yeso natural, fibra de vidrio y aditivos inorgánicos que le aportan alta dureza y resistencia mecánica. Incorpora tratamiento hidrófugo, disminuyendo así su capacidad de absorción de agua (menor al 5%). Idónea para proteger las estancias de los efectos adversos de la humedad. Reacción al fuego: EUROCLASE A1. Sistema de galces desiguales: las placas encajan entre ellas dejando una entrecalle de 3 mm por donde se inserta la pasta de juntas. Este sistema no utiliza cinta de papel. La pasta de juntas se aplica en las cavidades de las placas y una masilla elástica en los encuentros. Atornillada a cada lado de una estructura metálica de acero galvanizado formada por canales de 50 mm y montantes de 51x49x49 mm con una modulación de 600 mm entre ejes, dando un ancho total de tabique de 79 mm. Incluida parte proporcional del resto de materiales: tornillería, pasta de juntas, masilla para encuentros perimetrales, fijaciones, junta estanca, etc. Montaje según norma de instalación UNE 102043 y exigencias del CTE.","Tabique formado por una placa FUEGO de 15 mm de espesor compuesta por yeso natural, fibra de vidrio y aditivos inorgánicos que le aportan alta dureza y resistencia mecánica. Incorpora perlita y un aumento en la densidad que la hace idónea para un excelente comportamiento y resistencia frente al fuego. Reacción al fuego: EUROCLASE A1. Sistema de galces desiguales: las placas encajan entre ellas dejando una entrecalle de 3 mm por donde se inserta la pasta de juntas. Este sistema no utiliza cinta de papel. La pasta de juntas se aplica en las cavidades de las placas y una masilla elástica en los encuentros. Atornillada a cada lado de una estructura metálica de acero galvanizado formada por canales de 50 mm y montantes de 51x49x49 mm con una modulación de 600 mm entre ejes, dando un ancho total de tabique de 79 mm. Incluida parte proporcional del resto de materiales: tornillería, pasta de juntas, masilla para encuentros perimetrales, fijaciones, junta estanca, etc. Montaje según norma de instalación UNE 102043 y exigencias del CTE.","Tabique formado por una placa RESIST de 15 mm de espesor compuesta por yeso natural, fibra de vidrio y aditivos inorgánicos que le aportan alta dureza y resistencia mecánica. Con mayor cantidad de fibra de vidrio y dosificación modificada, aumenta su densidad, mejorando notablemente la resistencia mecánica. Idónea para lugares con altas exigencias en cuanto a deterioro y desgaste. Reacción al fuego: EUROCLASE A1. Sistema de galces desiguales: las placas encajan entre ellas dejando una entrecalle de 3 mm por donde se inserta la pasta de juntas. Este sistema no utiliza cinta de papel. La pasta de juntas se aplica en las cavidades de las placas y una masilla elástica en los encuentros. Atornillada a cada lado de una estructura metálica de acero galvanizado formada por canales de 50 mm y montantes de 51x49x49 mm con una modulación de 600 mm entre ejes, dando un ancho total de tabique de 79 mm. Incluida parte proporcional del resto de materiales: tornillería, pasta de juntas, masilla para encuentros perimetrales, fijaciones, junta estanca, etc. Montaje según norma de instalación UNE 102043 y exigencias del CTE.","Tabique formado por una placa HIDROPLUS de 15 mm de espesor compuesta por yeso natural, fibra de vidrio y aditivos inorgánicos que le aportan alta dureza y resistencia mecánica. Incorpora tratamiento hidrófugo y un aumento en su densidad, características claves para una elevada resistencia a la humedad (absorción de agua menor al 3%) y una gran resistencia mecánica. Idónea para zonas de intemperie. Reacción al fuego: EUROCLASE A1. Sistema de galces desiguales: las placas encajan entre ellas dejando una entrecalle de 3 mm por donde se inserta la pasta de juntas. Este sistema no utiliza cinta de papel. La pasta de juntas se aplica en las cavidades de las placas y una masilla elástica en los encuentros. Atornillada a cada lado de una estructura metálica de acero galvanizado formada por canales de 50 mm y montantes de 51x49x49 mm con una modulación de 600 mm entre ejes, dando un ancho total de tabique de 79 mm. Incluida parte proporcional del resto de materiales: tornillería, pasta de juntas, masilla para encuentros perimetrales, fijaciones, junta estanca, etc. Montaje según norma de instalación UNE 102043 y exigencias del CTE.","Tabique formado por una placa SUPREM de 15 mm de espesor compuesta por yeso natural, fibra de vidrio y aditivos inorgánicos que le aportan alta dureza y resistencia mecánica. Incorpora tratamiento hidrófugo, perlita y un aumento en la densidad para conseguir soluciones constructivas que cumplan, altos requisitos frente al fuego y una capacidad reducida de absorción de agua. Reacción al fuego: EUROCLASE A1. Sistema de galces desiguales: las placas encajan entre ellas dejando una entrecalle de 3 mm por donde se inserta la pasta de juntas. Este sistema no utiliza cinta de papel. La pasta de juntas se aplica en las cavidades de las placas y una masilla elástica en los encuentros. Atornillada a cada lado de una estructura metálica de acero galvanizado formada por canales de 50 mm y montantes de 51x49x49 mm con una modulación de 600 mm entre ejes, dando un ancho total de tabique de 79 mm. Incluida parte proporcional del resto de materiales: tornillería, pasta de juntas, masilla para encuentros perimetrales, fijaciones, junta estanca, etc. Montaje según norma de instalación UNE 102043 y exigencias del CTE."]
[null,null,64940,"1.1.3","TABIQUE ATT® 89/600 (49)  [20+49+20]",600,49,20,"Tabique formado por una placa BASIC de 20 mm de espesor compuesta por yeso natural, fibra de vidrio y aditivos inorgánicos que le aportan alta dureza y resistencia mecánica. Reacción al fuego: EUROCLASE A1. Sistema de galces desiguales: las placas encajan entre ellas dejando una entrecalle de 3 mm por donde se inserta la pasta de juntas. Este sistema no utiliza cinta de papel. La pasta de juntas se aplica en las cavidades de las placas y una masilla elástica en los encuentros. Atornillada a cada lado de una estructura metálica de acero galvanizado formada por canales de 50 mm y montantes de 51x49x49 mm con una modulación de 600 mm entre ejes, dando un ancho total de tabique de 89 mm. Incluida parte proporcional del resto de materiales: tornillería, pasta de juntas, masilla para encuentros perimetrales, fijaciones, junta estanca, etc. Montaje según norma de instalación UNE 102043 y exigencias del CTE.","Tabique formado por una placa HIDRO de 20 mm de espesor compuesta por yeso natural, fibra de vidrio y aditivos inorgánicos que le aportan alta dureza y resistencia mecánica. Incorpora tratamiento hidrófugo, disminuyendo así su capacidad de absorción de agua (menor al 5%). Idónea para proteger las estancias de los efectos adversos de la humedad. Reacción al fuego: EUROCLASE A1. Sistema de galces desiguales: las placas encajan entre ellas dejando una entrecalle de 3 mm por donde se inserta la pasta de juntas. Este sistema no utiliza cinta de papel. La pasta de juntas se aplica en las cavidades de las placas y una masilla elástica en los encuentros. Atornillada a cada lado de una estructura metálica de acero galvanizado formada por canales de 50 mm y montantes de 51x49x49 mm con una modulación de 600 mm entre ejes, dando un ancho total de tabique de 89 mm. Incluida parte proporcional del resto de materiales: tornillería, pasta de juntas, masilla para encuentros perimetrales, fijaciones, junta estanca, etc. Montaje según norma de instalación UNE 102043 y exigencias del CTE.","Tabique formado por una placa FUEGO de 20 mm de espesor compuesta por yeso natural, fibra de vidrio y aditivos inorgánicos que le aportan alta dureza y resistencia mecánica. Incorpora perlita y un aumento en la densidad que la hace idónea para un excelente comportamiento y resistencia frente al fuego. Reacción al fuego: EUROCLASE A1. Sistema de galces desiguales: las placas encajan entre ellas dejando una entrecalle de 3 mm por donde se inserta la pasta de juntas. Este sistema no utiliza cinta de papel. La pasta de juntas se aplica en las cavidades de las placas y una masilla elástica en los encuentros. Atornillada a cada lado de una estructura metálica de acero galvanizado formada por canales de 50 mm y montantes de 51x49x49 mm con una modulación de 600 mm entre ejes, dando un ancho total de tabique de 89 mm. Incluida parte proporcional del resto de materiales: tornillería, pasta de juntas, masilla para encuentros perimetrales, fijaciones, junta estanca, etc. Montaje según norma de instalación UNE 102043 y exigencias del CTE.","Tabique formado por una placa RESIST de 20 mm de espesor compuesta por yeso natural, fibra de vidrio y aditivos inorgánicos que le aportan alta dureza y resistencia mecánica. Con mayor cantidad de fibra de vidrio y dosificación modificada, aumenta su densidad, mejorando notablemente la resistencia mecánica. Idónea para lugares con altas exigencias en cuanto a deterioro y desgaste. Reacción al fuego: EUROCLASE A1. Sistema de galces desiguales: las placas encajan entre ellas dejando una entrecalle de 3 mm por donde se inserta la pasta de juntas. Este sistema no utiliza cinta de papel. La pasta de juntas se aplica en las cavidades de las placas y una masilla elástica en los encuentros. Atornillada a cada lado de una estructura metálica de acero galvanizado formada por canales de 50 mm y montantes de 51x49x49 mm con una modulación de 600 mm entre ejes, dando un ancho total de tabique de 89 mm. Incluida parte proporcional del resto de materiales: tornillería, pasta de juntas, masilla para encuentros perimetrales, fijaciones, junta estanca, etc. Montaje según norma de instalación UNE 102043 y exigencias del CTE.","Tabique formado por una placa HIDROPLUS de 20 mm de espesor compuesta por yeso natural, fibra de vidrio y aditivos inorgánicos que le aportan alta dureza y resistencia mecánica. Incorpora tratamiento hidrófugo y un aumento en su densidad, características claves para una elevada resistencia a la humedad (absorción de agua menor al 3%) y una gran resistencia mecánica. Idónea para zonas de intemperie. Reacción al fuego: EUROCLASE A1. Sistema de galces desiguales: las placas encajan entre ellas dejando una entrecalle de 3 mm por donde se inserta la pasta de juntas. Este sistema no utiliza cinta de papel. La pasta de juntas se aplica en las cavidades de las placas y una masilla elástica en los encuentros. Atornillada a cada lado de una estructura metálica de acero galvanizado formada por canales de 50 mm y montantes de 51x49x49 mm con una modulación de 600 mm entre ejes, dando un ancho total de tabique de 89 mm. Incluida parte proporcional del resto de materiales: tornillería, pasta de juntas, masilla para encuentros perimetrales, fijaciones, junta estanca, etc. Montaje según norma de instalación UNE 102043 y exigencias del CTE.","Tabique formado por una placa SUPREM de 20 mm de espesor compuesta por yeso natural, fibra de vidrio y aditivos inorgánicos que le aportan alta dureza y resistencia mecánica. Incorpora tratamiento hidrófugo, perlita y un aumento en la densidad para conseguir soluciones constructivas que cumplan, altos requisitos frente al fuego y una capacidad reducida de absorción de agua. Reacción al fuego: EUROCLASE A1. Sistema de galces desiguales: las placas encajan entre ellas dejando una entrecalle de 3 mm por donde se inserta la pasta de juntas. Este sistema no utiliza cinta de papel. La pasta de juntas se aplica en las cavidades de las placas y una masilla elástica en los encuentros. Atornillada a cada lado de una estructura metálica de acero galvanizado formada por canales de 50 mm y montantes de 51x49x49 mm con una modulación de 600 mm entre ejes, dando un ancho total de tabique de 89 mm. Incluida parte proporcional del resto de materiales: tornillería, pasta de juntas, masilla para encuentros perimetrales, fijaciones, junta estanca, etc. Montaje según norma de instalación UNE 102043 y exigencias del CTE."]
[null,null,67426,"1.1.4","TABIQUE ATT® 100/600 (74)  [13+74+13]",600,74,13,"Tabique formado por una placa BASIC de 13 mm de espesor compuesta por yeso natural, fibra de vidrio y aditivos inorgánicos que le aportan alta dureza y resistencia mecánica. Reacción al fuego: EUROCLASE A1. Sistema de galces desiguales: las placas encajan entre ellas dejando una entrecalle de 3 mm por donde se inserta la pasta de juntas. Este sistema no utiliza cinta de papel. La pasta de juntas se aplica en las cavidades de las placas y una masilla elástica en los encuentros. Atornillada a cada lado de una estructura metálica de acero galvanizado formada por canales de 75 mm y montantes de 51x74x49 mm con una modulación de 600 mm entre ejes, dando un ancho total de tabique de 100 mm. Incluida parte proporcional del resto de materiales: tornillería, pasta de juntas, masilla para encuentros perimetrales, fijaciones, junta estanca, etc. Montaje según norma de instalación UNE 102043 y exigencias del CTE.","Tabique formado por una placa HIDRO de 13 mm de espesor compuesta por yeso natural, fibra de vidrio y aditivos inorgánicos que le aportan alta dureza y resistencia mecánica. Incorpora tratamiento hidrófugo, disminuyendo así su capacidad de absorción de agua (menor al 5%). Idónea para proteger las estancias de los efectos adversos de la humedad. Reacción al fuego: EUROCLASE A1. Sistema de galces desiguales: las placas encajan entre ellas dejando una entrecalle de 3 mm por donde se inserta la pasta de juntas. Este sistema no utiliza cinta de papel. La pasta de juntas se aplica en las cavidades de las placas y una masilla elástica en los encuentros. Atornillada a cada lado de una estructura metálica de acero galvanizado formada por canales de 75 mm y montantes de 51x74x49 mm con una modulación de 600 mm entre ejes, dando un ancho total de tabique de 100 mm. Incluida parte proporcional del resto de materiales: tornillería, pasta de juntas, masilla para encuentros perimetrales, fijaciones, junta estanca, etc. Montaje según norma de instalación UNE 102043 y exigencias del CTE.","Tabique formado por una placa FUEGO de 13 mm de espesor compuesta por yeso natural, fibra de vidrio y aditivos inorgánicos que le aportan alta dureza y resistencia mecánica. Incorpora perlita y un aumento en la densidad que la hace idónea para un excelente comportamiento y resistencia frente al fuego. Reacción al fuego: EUROCLASE A1. Sistema de galces desiguales: las placas encajan entre ellas dejando una entrecalle de 3 mm por donde se inserta la pasta de juntas. Este sistema no utiliza cinta de papel. La pasta de juntas se aplica en las cavidades de las placas y una masilla elástica en los encuentros. Atornillada a cada lado de una estructura metálica de acero galvanizado formada por canales de 75 mm y montantes de 51x74x49 mm con una modulación de 600 mm entre ejes, dando un ancho total de tabique de 100 mm. Incluida parte proporcional del resto de materiales: tornillería, pasta de juntas, masilla para encuentros perimetrales, fijaciones, junta estanca, etc. Montaje según norma de instalación UNE 102043 y exigencias del CTE.","Tabique formado por una placa RESIST de 13 mm de espesor compuesta por yeso natural, fibra de vidrio y aditivos inorgánicos que le aportan alta dureza y resistencia mecánica. Con mayor cantidad de fibra de vidrio y dosificación modificada, aumenta su densidad, mejorando notablemente la resistencia mecánica. Idónea para lugares con altas exigencias en cuanto a deterioro y desgaste. Reacción al fuego: EUROCLASE A1. Sistema de galces desiguales: las placas encajan entre ellas dejando una entrecalle de 3 mm por donde se inserta la pasta de juntas. Este sistema no utiliza cinta de papel. La pasta de juntas se aplica en las cavidades de las placas y una masilla elástica en los encuentros. Atornillada a cada lado de una estructura metálica de acero galvanizado formada por canales de 75 mm y montantes de 51x74x49 mm con una modulación de 600 mm entre ejes, dando un ancho total de tabique de 100 mm. Incluida parte proporcional del resto de materiales: tornillería, pasta de juntas, masilla para encuentros perimetrales, fijaciones, junta estanca, etc. Montaje según norma de instalación UNE 102043 y exigencias del CTE.","Tabique formado por una placa HIDROPLUS de 13 mm de espesor compuesta por yeso natural, fibra de vidrio y aditivos inorgánicos que le aportan alta dureza y resistencia mecánica. Incorpora tratamiento hidrófugo y un aumento en su densidad, características claves para una elevada resistencia a la humedad (absorción de agua menor al 3%) y una gran resistencia mecánica. Idónea para zonas de intemperie. Reacción al fuego: EUROCLASE A1. Sistema de galces desiguales: las placas encajan entre ellas dejando una entrecalle de 3 mm por donde se inserta la pasta de juntas. Este sistema no utiliza cinta de papel. La pasta de juntas se aplica en las cavidades de las placas y una masilla elástica en los encuentros. Atornillada a cada lado de una estructura metálica de acero galvanizado formada por canales de 75 mm y montantes de 51x74x49 mm con una modulación de 600 mm entre ejes, dando un ancho total de tabique de 100 mm. Incluida parte proporcional del resto de materiales: tornillería, pasta de juntas, masilla para encuentros perimetrales, fijaciones, junta estanca, etc. Montaje según norma de instalación UNE 102043 y exigencias del CTE.","Tabique formado por una placa SUPREM de 13 mm de espesor compuesta por yeso natural, fibra de vidrio y aditivos inorgánicos que le aportan alta dureza y resistencia mecánica. Incorpora tratamiento hidrófugo, perlita y un aumento en la densidad para conseguir soluciones constructivas que cumplan, altos requisitos frente al fuego y una capacidad reducida de absorción de agua. Reacción al fuego: EUROCLASE A1. Sistema de galces desiguales: las placas encajan entre ellas dejando una entrecalle de 3 mm por donde se inserta la pasta de juntas. Este sistema no utiliza cinta de papel. La pasta de juntas se aplica en las cavidades de las placas y una masilla elástica en los encuentros. Atornillada a cada lado de una estructura metálica de acero galvanizado formada por canales de 75 mm y montantes de 51x74x49 mm con una modulación de 600 mm entre ejes, dando un ancho total de tabique de 100 mm. Incluida parte proporcional del resto de materiales: tornillería, pasta de juntas, masilla para encuentros perimetrales, fijaciones, junta estanca, etc. Montaje según norma de instalación UNE 102043 y exigencias del CTE."]
[null,null,67430,"1.1.5","TABIQUE ATT® 104/600 (74)  [15+74+15]",600,74,15,"Tabique formado por una placa BASIC de 15 mm de espesor compuesta por yeso natural, fibra de vidrio y aditivos inorgánicos que le aportan alta dureza y resistencia mecánica. Reacción al fuego: EUROCLASE A1. Sistema de galces desiguales: las placas encajan entre ellas dejando una entrecalle de 3 mm por donde se inserta la pasta de juntas. Este sistema no utiliza cinta de papel. La pasta de juntas se aplica en las cavidades de las placas y una masilla elástica en los encuentros. Atornillada a cada lado de una estructura metálica de acero galvanizado formada por canales de 75 mm y montantes de 51x74x49 mm con una modulación de 600 mm entre ejes, dando un ancho total de tabique de 104 mm. Incluida parte proporcional del resto de materiales: tornillería, pasta de juntas, masilla para encuentros perimetrales, fijaciones, junta estanca, etc. Montaje según norma de instalación UNE 102043 y exigencias del CTE.","Tabique formado por una placa HIDRO de 15 mm de espesor compuesta por yeso natural, fibra de vidrio y aditivos inorgánicos que le aportan alta dureza y resistencia mecánica. Incorpora tratamiento hidrófugo, disminuyendo así su capacidad de absorción de agua (menor al 5%). Idónea para proteger las estancias de los efectos adversos de la humedad. Reacción al fuego: EUROCLASE A1. Sistema de galces desiguales: las placas encajan entre ellas dejando una entrecalle de 3 mm por donde se inserta la pasta de juntas. Este sistema no utiliza cinta de papel. La pasta de juntas se aplica en las cavidades de las placas y una masilla elástica en los encuentros. Atornillada a cada lado de una estructura metálica de acero galvanizado formada por canales de 75 mm y montantes de 51x74x49 mm con una modulación de 600 mm entre ejes, dando un ancho total de tabique de 104 mm. Incluida parte proporcional del resto de materiales: tornillería, pasta de juntas, masilla para encuentros perimetrales, fijaciones, junta estanca, etc. Montaje según norma de instalación UNE 102043 y exigencias del CTE.","Tabique formado por una placa FUEGO de 15 mm de espesor compuesta por yeso natural, fibra de vidrio y aditivos inorgánicos que le aportan alta dureza y resistencia mecánica. Incorpora perlita y un aumento en la densidad que la hace idónea para un excelente comportamiento y resistencia frente al fuego. Reacción al fuego: EUROCLASE A1. Sistema de galces desiguales: las placas encajan entre ellas dejando una entrecalle de 3 mm por donde se inserta la pasta de juntas. Este sistema no utiliza cinta de papel. La pasta de juntas se aplica en las cavidades de las placas y una masilla elástica en los encuentros. Atornillada a cada lado de una estructura metálica de acero galvanizado formada por canales de 75 mm y montantes de 51x74x49 mm con una modulación de 600 mm entre ejes, dando un ancho total de tabique de 104 mm. Incluida parte proporcional del resto de materiales: tornillería, pasta de juntas, masilla para encuentros perimetrales, fijaciones, junta estanca, etc. Montaje según norma de instalación UNE 102043 y exigencias del CTE.","Tabique formado por una placa RESIST de 15 mm de espesor compuesta por yeso natural, fibra de vidrio y aditivos inorgánicos que le aportan alta dureza y resistencia mecánica. Con mayor cantidad de fibra de vidrio y dosificación modificada, aumenta su densidad, mejorando notablemente la resistencia mecánica. Idónea para lugares con altas exigencias en cuanto a deterioro y desgaste. Reacción al fuego: EUROCLASE A1. Sistema de galces desiguales: las placas encajan entre ellas dejando una entrecalle de 3 mm por donde se inserta la pasta de juntas. Este sistema no utiliza cinta de papel. La pasta de juntas se aplica en las cavidades de las placas y una masilla elástica en los encuentros. Atornillada a cada lado de una estructura metálica de acero galvanizado formada por canales de 75 mm y montantes de 51x74x49 mm con una modulación de 600 mm entre ejes, dando un ancho total de tabique de 104 mm. Incluida parte proporcional del resto de materiales: tornillería, pasta de juntas, masilla para encuentros perimetrales, fijaciones, junta estanca, etc. Montaje según norma de instalación UNE 102043 y exigencias del CTE.","Tabique formado por una placa HIDROPLUS de 15 mm de espesor compuesta por yeso natural, fibra de vidrio y aditivos inorgánicos que le aportan alta dureza y resistencia mecánica. Incorpora tratamiento hidrófugo y un aumento en su densidad, características claves para una elevada resistencia a la humedad (absorción de agua menor al 3%) y una gran resistencia mecánica. Idónea para zonas de intemperie. Reacción al fuego: EUROCLASE A1. Sistema de galces desiguales: las placas encajan entre ellas dejando una entrecalle de 3 mm por donde se inserta la pasta de juntas. Este sistema no utiliza cinta de papel. La pasta de juntas se aplica en las cavidades de las placas y una masilla elástica en los encuentros. Atornillada a cada lado de una estructura metálica de acero galvanizado formada por canales de 75 mm y montantes de 51x74x49 mm con una modulación de 600 mm entre ejes, dando un ancho total de tabique de 104 mm. Incluida parte proporcional del resto de materiales: tornillería, pasta de juntas, masilla para encuentros perimetrales, fijaciones, junta estanca, etc. Montaje según norma de instalación UNE 102043 y exigencias del CTE.","Tabique formado por una placa SUPREM de 15 mm de espesor compuesta por yeso natural, fibra de vidrio y aditivos inorgánicos que le aportan alta dureza y resistencia mecánica. Incorpora tratamiento hidrófugo, perlita y un aumento en la densidad para conseguir soluciones constructivas que cumplan, altos requisitos frente al fuego y una capacidad reducida de absorción de agua. Reacción al fuego: EUROCLASE A1. Sistema de galces desiguales: las placas encajan entre ellas dejando una entrecalle de 3 mm por donde se inserta la pasta de juntas. Este sistema no utiliza cinta de papel. La pasta de juntas se aplica en las cavidades de las placas y una masilla elástica en los encuentros. Atornillada a cada lado de una estructura metálica de acero galvanizado formada por canales de 75 mm y montantes de 51x74x49 mm con una modulación de 600 mm entre ejes, dando un ancho total de tabique de 104 mm. Incluida parte proporcional del resto de materiales: tornillería, pasta de juntas, masilla para encuentros perimetrales, fijaciones, junta estanca, etc. Montaje según norma de instalación UNE 102043 y exigencias del CTE."]
[null,null,67440,"1.1.6","TABIQUE ATT® 114/600 (74)  [20+74+20]",600,74,20,"Tabique formado por una placa BASIC de 20 mm de espesor compuesta por yeso natural, fibra de vidrio y aditivos inorgánicos que le aportan alta dureza y resistencia mecánica. Reacción al fuego: EUROCLASE A1. Sistema de galces desiguales: las placas encajan entre ellas dejando una entrecalle de 3 mm por donde se inserta la pasta de juntas. Este sistema no utiliza cinta de papel. La pasta de juntas se aplica en las cavidades de las placas y una masilla elástica en los encuentros. Atornillada a cada lado de una estructura metálica de acero galvanizado formada por canales de 75 mm y montantes de 51x74x49 mm con una modulación de 600 mm entre ejes, dando un ancho total de tabique de 114 mm. Incluida parte proporcional del resto de materiales: tornillería, pasta de juntas, masilla para encuentros perimetrales, fijaciones, junta estanca, etc. Montaje según norma de instalación UNE 102043 y exigencias del CTE.","Tabique formado por una placa HIDRO de 20 mm de espesor compuesta por yeso natural, fibra de vidrio y aditivos inorgánicos que le aportan alta dureza y resistencia mecánica. Incorpora tratamiento hidrófugo, disminuyendo así su capacidad de absorción de agua (menor al 5%). Idónea para proteger las estancias de los efectos adversos de la humedad. Reacción al fuego: EUROCLASE A1. Sistema de galces desiguales: las placas encajan entre ellas dejando una entrecalle de 3 mm por donde se inserta la pasta de juntas. Este sistema no utiliza cinta de papel. La pasta de juntas se aplica en las cavidades de las placas y una masilla elástica en los encuentros. Atornillada a cada lado de una estructura metálica de acero galvanizado formada por canales de 75 mm y montantes de 51x74x49 mm con una modulación de 600 mm entre ejes, dando un ancho total de tabique de 114 mm. Incluida parte proporcional del resto de materiales: tornillería, pasta de juntas, masilla para encuentros perimetrales, fijaciones, junta estanca, etc. Montaje según norma de instalación UNE 102043 y exigencias del CTE.","Tabique formado por una placa FUEGO de 20 mm de espesor compuesta por yeso natural, fibra de vidrio y aditivos inorgánicos que le aportan alta dureza y resistencia mecánica. Incorpora perlita y un aumento en la densidad que la hace idónea para un excelente comportamiento y resistencia frente al fuego. Reacción al fuego: EUROCLASE A1. Sistema de galces desiguales: las placas encajan entre ellas dejando una entrecalle de 3 mm por donde se inserta la pasta de juntas. Este sistema no utiliza cinta de papel. La pasta de juntas se aplica en las cavidades de las placas y una masilla elástica en los encuentros. Atornillada a cada lado de una estructura metálica de acero galvanizado formada por canales de 75 mm y montantes de 51x74x49 mm con una modulación de 600 mm entre ejes, dando un ancho total de tabique de 114 mm. Incluida parte proporcional del resto de materiales: tornillería, pasta de juntas, masilla para encuentros perimetrales, fijaciones, junta estanca, etc. Montaje según norma de instalación UNE 102043 y exigencias del CTE.","Tabique formado por una placa RESIST de 20 mm de espesor compuesta por yeso natural, fibra de vidrio y aditivos inorgánicos que le aportan alta dureza y resistencia mecánica. Con mayor cantidad de fibra de vidrio y dosificación modificada, aumenta su densidad, mejorando notablemente la resistencia mecánica. Idónea para lugares con altas exigencias en cuanto a deterioro y desgaste. Reacción al fuego: EUROCLASE A1. Sistema de galces desiguales: las placas encajan entre ellas dejando una entrecalle de 3 mm por donde se inserta la pasta de juntas. Este sistema no utiliza cinta de papel. La pasta de juntas se aplica en las cavidades de las placas y una masilla elástica en los encuentros. Atornillada a cada lado de una estructura metálica de acero galvanizado formada por canales de 75 mm y montantes de 51x74x49 mm con una modulación de 600 mm entre ejes, dando un ancho total de tabique de 114 mm. Incluida parte proporcional del resto de materiales: tornillería, pasta de juntas, masilla para encuentros perimetrales, fijaciones, junta estanca, etc. Montaje según norma de instalación UNE 102043 y exigencias del CTE.","Tabique formado por una placa HIDROPLUS de 20 mm de espesor compuesta por yeso natural, fibra de vidrio y aditivos inorgánicos que le aportan alta dureza y resistencia mecánica. Incorpora tratamiento hidrófugo y un aumento en su densidad, características claves para una elevada resistencia a la humedad (absorción de agua menor al 3%) y una gran resistencia mecánica. Idónea para zonas de intemperie. Reacción al fuego: EUROCLASE A1. Sistema de galces desiguales: las placas encajan entre ellas dejando una entrecalle de 3 mm por donde se inserta la pasta de juntas. Este sistema no utiliza cinta de papel. La pasta de juntas se aplica en las cavidades de las placas y una masilla elástica en los encuentros. Atornillada a cada lado de una estructura metálica de acero galvanizado formada por canales de 75 mm y montantes de 51x74x49 mm con una modulación de 600 mm entre ejes, dando un ancho total de tabique de 114 mm. Incluida parte proporcional del resto de materiales: tornillería, pasta de juntas, masilla para encuentros perimetrales, fijaciones, junta estanca, etc. Montaje según norma de instalación UNE 102043 y exigencias del CTE.","Tabique formado por una placa SUPREM de 20 mm de espesor compuesta por yeso natural, fibra de vidrio y aditivos inorgánicos que le aportan alta dureza y resistencia mecánica. Incorpora tratamiento hidrófugo, perlita y un aumento en la densidad para conseguir soluciones constructivas que cumplan, altos requisitos frente al fuego y una capacidad reducida de absorción de agua. Reacción al fuego: EUROCLASE A1. Sistema de galces desiguales: las placas encajan entre ellas dejando una entrecalle de 3 mm por donde se inserta la pasta de juntas. Este sistema no utiliza cinta de papel. La pasta de juntas se aplica en las cavidades de las placas y una masilla elástica en los encuentros. Atornillada a cada lado de una estructura metálica de acero galvanizado formada por canales de 75 mm y montantes de 51x74x49 mm con una modulación de 600 mm entre ejes, dando un ancho total de tabique de 114 mm. Incluida parte proporcional del resto de materiales: tornillería, pasta de juntas, masilla para encuentros perimetrales, fijaciones, junta estanca, etc. Montaje según norma de instalación UNE 102043 y exigencias del CTE."]
[null,null,69926,"1.1.7","TABIQUE ATT® 125/600 (99)  [13+99+13]",600,99,13,"Tabique formado por una placa BASIC de 13 mm de espesor compuesta por yeso natural, fibra de vidrio y aditivos inorgánicos que le aportan alta dureza y resistencia mecánica. Reacción al fuego: EUROCLASE A1. Sistema de galces desiguales: las placas encajan entre ellas dejando una entrecalle de 3 mm por donde se inserta la pasta de juntas. Este sistema no utiliza cinta de papel. La pasta de juntas se aplica en las cavidades de las placas y una masilla elástica en los encuentros. Atornillada a cada lado de una estructura metálica de acero galvanizado formada por canales de 100 mm y montantes de 51x99x49 mm con una modulación de 600 mm entre ejes, dando un ancho total de tabique de 125 mm. Incluida parte proporcional del resto de materiales: tornillería, pasta de juntas, masilla para encuentros perimetrales, fijaciones, junta estanca, etc. Montaje según norma de instalación UNE 102043 y exigencias del CTE.","Tabique formado por una placa HIDRO de 13 mm de espesor compuesta por yeso natural, fibra de vidrio y aditivos inorgánicos que le aportan alta dureza y resistencia mecánica. Incorpora tratamiento hidrófugo, disminuyendo así su capacidad de absorción de agua (menor al 5%). Idónea para proteger las estancias de los efectos adversos de la humedad. Reacción al fuego: EUROCLASE A1. Sistema de galces desiguales: las placas encajan entre ellas dejando una entrecalle de 3 mm por donde se inserta la pasta de juntas. Este sistema no utiliza cinta de papel. La pasta de juntas se aplica en las cavidades de las placas y una masilla elástica en los encuentros. Atornillada a cada lado de una estructura metálica de acero galvanizado formada por canales de 100 mm y montantes de 51x99x49 mm con una modulación de 600 mm entre ejes, dando un ancho total de tabique de 125 mm. Incluida parte proporcional del resto de materiales: tornillería, pasta de juntas, masilla para encuentros perimetrales, fijaciones, junta estanca, etc. Montaje según norma de instalación UNE 102043 y exigencias del CTE.","Tabique formado por una placa FUEGO de 13 mm de espesor compuesta por yeso natural, fibra de vidrio y aditivos inorgánicos que le aportan alta dureza y resistencia mecánica. Incorpora perlita y un aumento en la densidad que la hace idónea para un excelente comportamiento y resistencia frente al fuego. Reacción al fuego: EUROCLASE A1. Sistema de galces desiguales: las placas encajan entre ellas dejando una entrecalle de 3 mm por donde se inserta la pasta de juntas. Este sistema no utiliza cinta de papel. La pasta de juntas se aplica en las cavidades de las placas y una masilla elástica en los encuentros. Atornillada a cada lado de una estructura metálica de acero galvanizado formada por canales de 100 mm y montantes de 51x99x49 mm con una modulación de 600 mm entre ejes, dando un ancho total de tabique de 125 mm. Incluida parte proporcional del resto de materiales: tornillería, pasta de juntas, masilla para encuentros perimetrales, fijaciones, junta estanca, etc. Montaje según norma de instalación UNE 102043 y exigencias del CTE.","Tabique formado por una placa RESIST de 13 mm de espesor compuesta por yeso natural, fibra de vidrio y aditivos inorgánicos que le aportan alta dureza y resistencia mecánica. Con mayor cantidad de fibra de vidrio y dosificación modificada, aumenta su densidad, mejorando notablemente la resistencia mecánica. Idónea para lugares con altas exigencias en cuanto a deterioro y desgaste. Reacción al fuego: EUROCLASE A1. Sistema de galces desiguales: las placas encajan entre ellas dejando una entrecalle de 3 mm por donde se inserta la pasta de juntas. Este sistema no utiliza cinta de papel. La pasta de juntas se aplica en las cavidades de las placas y una masilla elástica en los encuentros. Atornillada a cada lado de una estructura metálica de acero galvanizado formada por canales de 100 mm y montantes de 51x99x49 mm con una modulación de 600 mm entre ejes, dando un ancho total de tabique de 125 mm. Incluida parte proporcional del resto de materiales: tornillería, pasta de juntas, masilla para encuentros perimetrales, fijaciones, junta estanca, etc. Montaje según norma de instalación UNE 102043 y exigencias del CTE.","Tabique formado por una placa HIDROPLUS de 13 mm de espesor compuesta por yeso natural, fibra de vidrio y aditivos inorgánicos que le aportan alta dureza y resistencia mecánica. Incorpora tratamiento hidrófugo y un aumento en su densidad, características claves para una elevada resistencia a la humedad (absorción de agua menor al 3%) y una gran resistencia mecánica. Idónea para zonas de intemperie. Reacción al fuego: EUROCLASE A1. Sistema de galces desiguales: las placas encajan entre ellas dejando una entrecalle de 3 mm por donde se inserta la pasta de juntas. Este sistema no utiliza cinta de papel. La pasta de juntas se aplica en las cavidades de las placas y una masilla elástica en los encuentros. Atornillada a cada lado de una estructura metálica de acero galvanizado formada por canales de 100 mm y montantes de 51x99x49 mm con una modulación de 600 mm entre ejes, dando un ancho total de tabique de 125 mm. Incluida parte proporcional del resto de materiales: tornillería, pasta de juntas, masilla para encuentros perimetrales, fijaciones, junta estanca, etc. Montaje según norma de instalación UNE 102043 y exigencias del CTE.","Tabique formado por una placa SUPREM de 13 mm de espesor compuesta por yeso natural, fibra de vidrio y aditivos inorgánicos que le aportan alta dureza y resistencia mecánica. Incorpora tratamiento hidrófugo, perlita y un aumento en la densidad para conseguir soluciones constructivas que cumplan, altos requisitos frente al fuego y una capacidad reducida de absorción de agua. Reacción al fuego: EUROCLASE A1. Sistema de galces desiguales: las placas encajan entre ellas dejando una entrecalle de 3 mm por donde se inserta la pasta de juntas. Este sistema no utiliza cinta de papel. La pasta de juntas se aplica en las cavidades de las placas y una masilla elástica en los encuentros. Atornillada a cada lado de una estructura metálica de acero galvanizado formada por canales de 100 mm y montantes de 51x99x49 mm con una modulación de 600 mm entre ejes, dando un ancho total de tabique de 125 mm. Incluida parte proporcional del resto de materiales: tornillería, pasta de juntas, masilla para encuentros perimetrales, fijaciones, junta estanca, etc. Montaje según norma de instalación UNE 102043 y exigencias del CTE."]
["PLACA DOBLE",null,69930,"1.1.8","TABIQUE ATT® 129/600 (99)  [15+99+15]",600,99,15,"Tabique formado por una placa BASIC de 15 mm de espesor compuesta por yeso natural, fibra de vidrio y aditivos inorgánicos que le aportan alta dureza y resistencia mecánica. Reacción al fuego: EUROCLASE A1. Sistema de galces desiguales: las placas encajan entre ellas dejando una entrecalle de 3 mm por donde se inserta la pasta de juntas. Este sistema no utiliza cinta de papel. La pasta de juntas se aplica en las cavidades de las placas y una masilla elástica en los encuentros. Atornillada a cada lado de una estructura metálica de acero galvanizado formada por canales de 100 mm y montantes de 51x99x49 mm con una modulación de 600 mm entre ejes, dando un ancho total de tabique de 129 mm. Incluida parte proporcional del resto de materiales: tornillería, pasta de juntas, masilla para encuentros perimetrales, fijaciones, junta estanca, etc. Montaje según norma de instalación UNE 102043 y exigencias del CTE.","Tabique formado por una placa HIDRO de 15 mm de espesor compuesta por yeso natural, fibra de vidrio y aditivos inorgánicos que le aportan alta dureza y resistencia mecánica. Incorpora tratamiento hidrófugo, disminuyendo así su capacidad de absorción de agua (menor al 5%). Idónea para proteger las estancias de los efectos adversos de la humedad. Reacción al fuego: EUROCLASE A1. Sistema de galces desiguales: las placas encajan entre ellas dejando una entrecalle de 3 mm por donde se inserta la pasta de juntas. Este sistema no utiliza cinta de papel. La pasta de juntas se aplica en las cavidades de las placas y una masilla elástica en los encuentros. Atornillada a cada lado de una estructura metálica de acero galvanizado formada por canales de 100 mm y montantes de 51x99x49 mm con una modulación de 600 mm entre ejes, dando un ancho total de tabique de 129 mm. Incluida parte proporcional del resto de materiales: tornillería, pasta de juntas, masilla para encuentros perimetrales, fijaciones, junta estanca, etc. Montaje según norma de instalación UNE 102043 y exigencias del CTE.","Tabique formado por una placa FUEGO de 15 mm de espesor compuesta por yeso natural, fibra de vidrio y aditivos inorgánicos que le aportan alta dureza y resistencia mecánica. Incorpora perlita y un aumento en la densidad que la hace idónea para un excelente comportamiento y resistencia frente al fuego. Reacción al fuego: EUROCLASE A1. Sistema de galces desiguales: las placas encajan entre ellas dejando una entrecalle de 3 mm por donde se inserta la pasta de juntas. Este sistema no utiliza cinta de papel. La pasta de juntas se aplica en las cavidades de las placas y una masilla elástica en los encuentros. Atornillada a cada lado de una estructura metálica de acero galvanizado formada por canales de 100 mm y montantes de 51x99x49 mm con una modulación de 600 mm entre ejes, dando un ancho total de tabique de 129 mm. Incluida parte proporcional del resto de materiales: tornillería, pasta de juntas, masilla para encuentros perimetrales, fijaciones, junta estanca, etc. Montaje según norma de instalación UNE 102043 y exigencias del CTE.","Tabique formado por una placa RESIST de 15 mm de espesor compuesta por yeso natural, fibra de vidrio y aditivos inorgánicos que le aportan alta dureza y resistencia mecánica. Con mayor cantidad de fibra de vidrio y dosificación modificada, aumenta su densidad, mejorando notablemente la resistencia mecánica. Idónea para lugares con altas exigencias en cuanto a deterioro y desgaste. Reacción al fuego: EUROCLASE A1. Sistema de galces desiguales: las placas encajan entre ellas dejando una entrecalle de 3 mm por donde se inserta la pasta de juntas. Este sistema no utiliza cinta de papel. La pasta de juntas se aplica en las cavidades de las placas y una masilla elástica en los encuentros. Atornillada a cada lado de una estructura metálica de acero galvanizado formada por canales de 100 mm y montantes de 51x99x49 mm con una modulación de 600 mm entre ejes, dando un ancho total de tabique de 129 mm. Incluida parte proporcional del resto de materiales: tornillería, pasta de juntas, masilla para encuentros perimetrales, fijaciones, junta estanca, etc. Montaje según norma de instalación UNE 102043 y exigencias del CTE.","Tabique formado por una placa HIDROPLUS de 15 mm de espesor compuesta por yeso natural, fibra de vidrio y aditivos inorgánicos que le aportan alta dureza y resistencia mecánica. Incorpora tratamiento hidrófugo y un aumento en su densidad, características claves para una elevada resistencia a la humedad (absorción de agua menor al 3%) y una gran resistencia mecánica. Idónea para zonas de intemperie. Reacción al fuego: EUROCLASE A1. Sistema de galces desiguales: las placas encajan entre ellas dejando una entrecalle de 3 mm por donde se inserta la pasta de juntas. Este sistema no utiliza cinta de papel. La pasta de juntas se aplica en las cavidades de las placas y una masilla elástica en los encuentros. Atornillada a cada lado de una estructura metálica de acero galvanizado formada por canales de 100 mm y montantes de 51x99x49 mm con una modulación de 600 mm entre ejes, dando un ancho total de tabique de 129 mm. Incluida parte proporcional del resto de materiales: tornillería, pasta de juntas, masilla para encuentros perimetrales, fijaciones, junta estanca, etc. Montaje según norma de instalación UNE 102043 y exigencias del CTE.","Tabique formado por una placa SUPREM de 15 mm de espesor compuesta por yeso natural, fibra de vidrio y aditivos inorgánicos que le aportan alta dureza y resistencia mecánica. Incorpora tratamiento hidrófugo, perlita y un aumento en la densidad para conseguir soluciones constructivas que cumplan, altos requisitos frente al fuego y una capacidad reducida de absorción de agua. Reacción al fuego: EUROCLASE A1. Sistema de galces desiguales: las placas encajan entre ellas dejando una entrecalle de 3 mm por donde se inserta la pasta de juntas. Este sistema no utiliza cinta de papel. La pasta de juntas se aplica en las cavidades de las placas y una masilla elástica en los encuentros. Atornillada a cada lado de una estructura metálica de acero galvanizado formada por canales de 100 mm y montantes de 51x99x49 mm con una modulación de 600 mm entre ejes, dando un ancho total de tabique de 129 mm. Incluida parte proporcional del resto de materiales: tornillería, pasta de juntas, masilla para encuentros perimetrales, fijaciones, junta estanca, etc. Montaje según norma de instalación UNE 102043 y exigencias del CTE."]
[null,null,69940,"1.1.9","TABIQUE ATT® 139/600 (99)  [20+99+20]",600,99,20,"Tabique formado por una placa BASIC de 20 mm de espesor compuesta por yeso natural, fibra de vidrio y aditivos inorgánicos que le aportan alta dureza y resistencia mecánica. Reacción al fuego: EUROCLASE A1. Sistema de galces desiguales: las placas encajan entre ellas dejando una entrecalle de 3 mm por donde se inserta la pasta de juntas. Este sistema no utiliza cinta de papel. La pasta de juntas se aplica en las cavidades de las placas y una masilla elástica en los encuentros. Atornillada a cada lado de una estructura metálica de acero galvanizado formada por canales de 100 mm y montantes de 51x99x49 mm con una modulación de 600 mm entre ejes, dando un ancho total de tabique de 139 mm. Incluida parte proporcional del resto de materiales: tornillería, pasta de juntas, masilla para encuentros perimetrales, fijaciones, junta estanca, etc. Montaje según norma de instalación UNE 102043 y exigencias del CTE.","Tabique formado por una placa HIDRO de 20 mm de espesor compuesta por yeso natural, fibra de vidrio y aditivos inorgánicos que le aportan alta dureza y resistencia mecánica. Incorpora tratamiento hidrófugo, disminuyendo así su capacidad de absorción de agua (menor al 5%). Idónea para proteger las estancias de los efectos adversos de la humedad. Reacción al fuego: EUROCLASE A1. Sistema de galces desiguales: las placas encajan entre ellas dejando una entrecalle de 3 mm por donde se inserta la pasta de juntas. Este sistema no utiliza cinta de papel. La pasta de juntas se aplica en las cavidades de las placas y una masilla elástica en los encuentros. Atornillada a cada lado de una estructura metálica de acero galvanizado formada por canales de 100 mm y montantes de 51x99x49 mm con una modulación de 600 mm entre ejes, dando un ancho total de tabique de 139 mm. Incluida parte proporcional del resto de materiales: tornillería, pasta de juntas, masilla para encuentros perimetrales, fijaciones, junta estanca, etc. Montaje según norma de instalación UNE 102043 y exigencias del CTE.","Tabique formado por una placa FUEGO de 20 mm de espesor compuesta por yeso natural, fibra de vidrio y aditivos inorgánicos que le aportan alta dureza y resistencia mecánica. Incorpora perlita y un aumento en la densidad que la hace idónea para un excelente comportamiento y resistencia frente al fuego. Reacción al fuego: EUROCLASE A1. Sistema de galces desiguales: las placas encajan entre ellas dejando una entrecalle de 3 mm por donde se inserta la pasta de juntas. Este sistema no utiliza cinta de papel. La pasta de juntas se aplica en las cavidades de las placas y una masilla elástica en los encuentros. Atornillada a cada lado de una estructura metálica de acero galvanizado formada por canales de 100 mm y montantes de 51x99x49 mm con una modulación de 600 mm entre ejes, dando un ancho total de tabique de 139 mm. Incluida parte proporcional del resto de materiales: tornillería, pasta de juntas, masilla para encuentros perimetrales, fijaciones, junta estanca, etc. Montaje según norma de instalación UNE 102043 y exigencias del CTE.","Tabique formado por una placa RESIST de 20 mm de espesor compuesta por yeso natural, fibra de vidrio y aditivos inorgánicos que le aportan alta dureza y resistencia mecánica. Con mayor cantidad de fibra de vidrio y dosificación modificada, aumenta su densidad, mejorando notablemente la resistencia mecánica. Idónea para lugares con altas exigencias en cuanto a deterioro y desgaste. Reacción al fuego: EUROCLASE A1. Sistema de galces desiguales: las placas encajan entre ellas dejando una entrecalle de 3 mm por donde se inserta la pasta de juntas. Este sistema no utiliza cinta de papel. La pasta de juntas se aplica en las cavidades de las placas y una masilla elástica en los encuentros. Atornillada a cada lado de una estructura metálica de acero galvanizado formada por canales de 100 mm y montantes de 51x99x49 mm con una modulación de 600 mm entre ejes, dando un ancho total de tabique de 139 mm. Incluida parte proporcional del resto de materiales: tornillería, pasta de juntas, masilla para encuentros perimetrales, fijaciones, junta estanca, etc. Montaje según norma de instalación UNE 102043 y exigencias del CTE.","Tabique formado por una placa HIDROPLUS de 20 mm de espesor compuesta por yeso natural, fibra de vidrio y aditivos inorgánicos que le aportan alta dureza y resistencia mecánica. Incorpora tratamiento hidrófugo y un aumento en su densidad, características claves para una elevada resistencia a la humedad (absorción de agua menor al 3%) y una gran resistencia mecánica. Idónea para zonas de intemperie. Reacción al fuego: EUROCLASE A1. Sistema de galces desiguales: las placas encajan entre ellas dejando una entrecalle de 3 mm por donde se inserta la pasta de juntas. Este sistema no utiliza cinta de papel. La pasta de juntas se aplica en las cavidades de las placas y una masilla elástica en los encuentros. Atornillada a cada lado de una estructura metálica de acero galvanizado formada por canales de 100 mm y montantes de 51x99x49 mm con una modulación de 600 mm entre ejes, dando un ancho total de tabique de 139 mm. Incluida parte proporcional del resto de materiales: tornillería, pasta de juntas, masilla para encuentros perimetrales, fijaciones, junta estanca, etc. Montaje según norma de instalación UNE 102043 y exigencias del CTE.","Tabique formado por una placa SUPREM de 20 mm de espesor compuesta por yeso natural, fibra de vidrio y aditivos inorgánicos que le aportan alta dureza y resistencia mecánica. Incorpora tratamiento hidrófugo, perlita y un aumento en la densidad para conseguir soluciones constructivas que cumplan, altos requisitos frente al fuego y una capacidad reducida de absorción de agua. Reacción al fuego: EUROCLASE A1. Sistema de galces desiguales: las placas encajan entre ellas dejando una entrecalle de 3 mm por donde se inserta la pasta de juntas. Este sistema no utiliza cinta de papel. La pasta de juntas se aplica en las cavidades de las placas y una masilla elástica en los encuentros. Atornillada a cada lado de una estructura metálica de acero galvanizado formada por canales de 100 mm y montantes de 51x99x49 mm con una modulación de 600 mm entre ejes, dando un ancho total de tabique de 139 mm. Incluida parte proporcional del resto de materiales: tornillería, pasta de juntas, masilla para encuentros perimetrales, fijaciones, junta estanca, etc. Montaje según norma de instalación UNE 102043 y exigencias del CTE."]
[null,null,{"$f":"F14*100+G14*100+H14*2","v":44926},"1.1.10","TABIQUE ATT® 75/400 (49)  [13+49+13]",400,49,13,"Tabique formado por una placa BASIC de 13 mm de espesor compuesta por yeso natural, fibra de vidrio y aditivos inorgánicos que le aportan alta dureza y resistencia mecánica. Reacción al fuego: EUROCLASE A1. Sistema de galces desiguales: las placas encajan entre ellas dejando una entrecalle de 3 mm por donde se inserta la pasta de juntas. Este sistema no utiliza cinta de papel. La pasta de juntas se aplica en las cavidades de las placas y una masilla elástica en los encuentros. Atornillada a cada lado de una estructura metálica de acero galvanizado formada por canales de 50 mm y montantes de 51x49x49 mm con una modulación de 400 mm entre ejes, dando un ancho total de tabique de 75 mm. Incluida parte proporcional del resto de materiales: tornillería, pasta de juntas, masilla para encuentros perimetrales, fijaciones, junta estanca, etc. Montaje según norma de instalación UNE 102043 y exigencias del CTE.","Tabique formado por una placa HIDRO de 13 mm de espesor compuesta por yeso natural, fibra de vidrio y aditivos inorgánicos que le aportan alta dureza y resistencia mecánica. Incorpora tratamiento hidrófugo, disminuyendo así su capacidad de absorción de agua (menor al 5%). Idónea para proteger las estancias de los efectos adversos de la humedad. Reacción al fuego: EUROCLASE A1. Sistema de galces desiguales: las placas encajan entre ellas dejando una entrecalle de 3 mm por donde se inserta la pasta de juntas. Este sistema no utiliza cinta de papel. La pasta de juntas se aplica en las cavidades de las placas y una masilla elástica en los encuentros. Atornillada a cada lado de una estructura metálica de acero galvanizado formada por canales de 50 mm y montantes de 51x49x49 mm con una modulación de 400 mm entre ejes, dando un ancho total de tabique de 75 mm. Incluida parte proporcional del resto de materiales: tornillería, pasta de juntas, masilla para encuentros perimetrales, fijaciones, junta estanca, etc. Montaje según norma de instalación UNE 102043 y exigencias del CTE.","Tabique formado por una placa FUEGO de 13 mm de espesor compuesta por yeso natural, fibra de vidrio y aditivos inorgánicos que le aportan alta dureza y resistencia mecánica. Incorpora perlita y un aumento en la densidad que la hace idónea para un excelente comportamiento y resistencia frente al fuego. Reacción al fuego: EUROCLASE A1. Sistema de galces desiguales: las placas encajan entre ellas dejando una entrecalle de 3 mm por donde se inserta la pasta de juntas. Este sistema no utiliza cinta de papel. La pasta de juntas se aplica en las cavidades de las placas y una masilla elástica en los encuentros. Atornillada a cada lado de una estructura metálica de acero galvanizado formada por canales de 50 mm y montantes de 51x49x49 mm con una modulación de 400 mm entre ejes, dando un ancho total de tabique de 75 mm. Incluida parte proporcional del resto de materiales: tornillería, pasta de juntas, masilla para encuentros perimetrales, fijaciones, junta estanca, etc. Montaje según norma de instalación UNE 102043 y exigencias del CTE.","Tabique formado por una placa RESIST de 13 mm de espesor compuesta por yeso natural, fibra de vidrio y aditivos inorgánicos que le aportan alta dureza y resistencia mecánica. Con mayor cantidad de fibra de vidrio y dosificación modificada, aumenta su densidad, mejorando notablemente la resistencia mecánica. Idónea para lugares con altas exigencias en cuanto a deterioro y desgaste. Reacción al fuego: EUROCLASE A1. Sistema de galces desiguales: las placas encajan entre ellas dejando una entrecalle de 3 mm por donde se inserta la pasta de juntas. Este sistema no utiliza cinta de papel. La pasta de juntas se aplica en las cavidades de las placas y una masilla elástica en los encuentros. Atornillada a cada lado de una estructura metálica de acero galvanizado formada por canales de 50 mm y montantes de 51x49x49 mm con una modulación de 400 mm entre ejes, dando un ancho total de tabique de 75 mm. Incluida parte proporcional del resto de materiales: tornillería, pasta de juntas, masilla para encuentros perimetrales, fijaciones, junta estanca, etc. Montaje según norma de instalación UNE 102043 y exigencias del CTE.","Tabique formado por una placa HIDROPLUS de 13 mm de espesor compuesta por yeso natural, fibra de vidrio y aditivos inorgánicos que le aportan alta dureza y resistencia mecánica. Incorpora tratamiento hidrófugo y un aumento en su densidad, características claves para una elevada resistencia a la humedad (absorción de agua menor al 3%) y una gran resistencia mecánica. Idónea para zonas de intemperie. Reacción al fuego: EUROCLASE A1. Sistema de galces desiguales: las placas encajan entre ellas dejando una entrecalle de 3 mm por donde se inserta la pasta de juntas. Este sistema no utiliza cinta de papel. La pasta de juntas se aplica en las cavidades de las placas y una masilla elástica en los encuentros. Atornillada a cada lado de una estructura metálica de acero galvanizado formada por canales de 50 mm y montantes de 51x49x49 mm con una modulación de 400 mm entre ejes, dando un ancho total de tabique de 75 mm. Incluida parte proporcional del resto de materiales: tornillería, pasta de juntas, masilla para encuentros perimetrales, fijaciones, junta estanca, etc. Montaje según norma de instalación UNE 102043 y exigencias del CTE.","Tabique formado por una placa SUPREM de 13 mm de espesor compuesta por yeso natural, fibra de vidrio y aditivos inorgánicos que le aportan alta dureza y resistencia mecánica. Incorpora tratamiento hidrófugo, perlita y un aumento en la densidad para conseguir soluciones constructivas que cumplan, altos requisitos frente al fuego y una capacidad reducida de absorción de agua. Reacción al fuego: EUROCLASE A1. Sistema de galces desiguales: las placas encajan entre ellas dejando una entrecalle de 3 mm por donde se inserta la pasta de juntas. Este sistema no utiliza cinta de papel. La pasta de juntas se aplica en las cavidades de las placas y una masilla elástica en los encuentros. Atornillada a cada lado de una estructura metálica de acero galvanizado formada por canales de 50 mm y montantes de 51x49x49 mm con una modulación de 400 mm entre ejes, dando un ancho total de tabique de 75 mm. Incluida parte proporcional del resto de materiales: tornillería, pasta de juntas, masilla para encuentros perimetrales, fijaciones, junta estanca, etc. Montaje según norma de instalación UNE 102043 y exigencias del CTE."]
[null,null,{"$f":"F15*100+G15*100+H15*2","v":44930},"1.1.11","TABIQUE ATT® 79/400 (49)  [15+49+15]",400,49,15,"Tabique formado por una placa BASIC de 15 mm de espesor compuesta por yeso natural, fibra de vidrio y aditivos inorgánicos que le aportan alta dureza y resistencia mecánica. Reacción al fuego: EUROCLASE A1. Sistema de galces desiguales: las placas encajan entre ellas dejando una entrecalle de 3 mm por donde se inserta la pasta de juntas. Este sistema no utiliza cinta de papel. La pasta de juntas se aplica en las cavidades de las placas y una masilla elástica en los encuentros. Atornillada a cada lado de una estructura metálica de acero galvanizado formada por canales de 50 mm y montantes de 51x49x49 mm con una modulación de 400 mm entre ejes, dando un ancho total de tabique de 79 mm. Incluida parte proporcional del resto de materiales: tornillería, pasta de juntas, masilla para encuentros perimetrales, fijaciones, junta estanca, etc. Montaje según norma de instalación UNE 102043 y exigencias del CTE.","Tabique formado por una placa HIDRO de 15 mm de espesor compuesta por yeso natural, fibra de vidrio y aditivos inorgánicos que le aportan alta dureza y resistencia mecánica. Incorpora tratamiento hidrófugo, disminuyendo así su capacidad de absorción de agua (menor al 5%). Idónea para proteger las estancias de los efectos adversos de la humedad. Reacción al fuego: EUROCLASE A1. Sistema de galces desiguales: las placas encajan entre ellas dejando una entrecalle de 3 mm por donde se inserta la pasta de juntas. Este sistema no utiliza cinta de papel. La pasta de juntas se aplica en las cavidades de las placas y una masilla elástica en los encuentros. Atornillada a cada lado de una estructura metálica de acero galvanizado formada por canales de 50 mm y montantes de 51x49x49 mm con una modulación de 400 mm entre ejes, dando un ancho total de tabique de 79 mm. Incluida parte proporcional del resto de materiales: tornillería, pasta de juntas, masilla para encuentros perimetrales, fijaciones, junta estanca, etc. Montaje según norma de instalación UNE 102043 y exigencias del CTE.","Tabique formado por una placa FUEGO de 15 mm de espesor compuesta por yeso natural, fibra de vidrio y aditivos inorgánicos que le aportan alta dureza y resistencia mecánica. Incorpora perlita y un aumento en la densidad que la hace idónea para un excelente comportamiento y resistencia frente al fuego. Reacción al fuego: EUROCLASE A1. Sistema de galces desiguales: las placas encajan entre ellas dejando una entrecalle de 3 mm por donde se inserta la pasta de juntas. Este sistema no utiliza cinta de papel. La pasta de juntas se aplica en las cavidades de las placas y una masilla elástica en los encuentros. Atornillada a cada lado de una estructura metálica de acero galvanizado formada por canales de 50 mm y montantes de 51x49x49 mm con una modulación de 400 mm entre ejes, dando un ancho total de tabique de 79 mm. Incluida parte proporcional del resto de materiales: tornillería, pasta de juntas, masilla para encuentros perimetrales, fijaciones, junta estanca, etc. Montaje según norma de instalación UNE 102043 y exigencias del CTE.","Tabique formado por una placa RESIST de 15 mm de espesor compuesta por yeso natural, fibra de vidrio y aditivos inorgánicos que le aportan alta dureza y resistencia mecánica. Con mayor cantidad de fibra de vidrio y dosificación modificada, aumenta su densidad, mejorando notablemente la resistencia mecánica. Idónea para lugares con altas exigencias en cuanto a deterioro y desgaste. Reacción al fuego: EUROCLASE A1. Sistema de galces desiguales: las placas encajan entre ellas dejando una entrecalle de 3 mm por donde se inserta la pasta de juntas. Este sistema no utiliza cinta de papel. La pasta de juntas se aplica en las cavidades de las placas y una masilla elástica en los encuentros. Atornillada a cada lado de una estructura metálica de acero galvanizado formada por canales de 50 mm y montantes de 51x49x49 mm con una modulación de 400 mm entre ejes, dando un ancho total de tabique de 79 mm. Incluida parte proporcional del resto de materiales: tornillería, pasta de juntas, masilla para encuentros perimetrales, fijaciones, junta estanca, etc. Montaje según norma de instalación UNE 102043 y exigencias del CTE.","Tabique formado por una placa HIDROPLUS de 15 mm de espesor compuesta por yeso natural, fibra de vidrio y aditivos inorgánicos que le aportan alta dureza y resistencia mecánica. Incorpora tratamiento hidrófugo y un aumento en su densidad, características claves para una elevada resistencia a la humedad (absorción de agua menor al 3%) y una gran resistencia mecánica. Idónea para zonas de intemperie. Reacción al fuego: EUROCLASE A1. Sistema de galces desiguales: las placas encajan entre ellas dejando una entrecalle de 3 mm por donde se inserta la pasta de juntas. Este sistema no utiliza cinta de papel. La pasta de juntas se aplica en las cavidades de las placas y una masilla elástica en los encuentros. Atornillada a cada lado de una estructura metálica de acero galvanizado formada por canales de 50 mm y montantes de 51x49x49 mm con una modulación de 400 mm entre ejes, dando un ancho total de tabique de 79 mm. Incluida parte proporcional del resto de materiales: tornillería, pasta de juntas, masilla para encuentros perimetrales, fijaciones, junta estanca, etc. Montaje según norma de instalación UNE 102043 y exigencias del CTE.","Tabique formado por una placa SUPREM de 15 mm de espesor compuesta por yeso natural, fibra de vidrio y aditivos inorgánicos que le aportan alta dureza y resistencia mecánica. Incorpora tratamiento hidrófugo, perlita y un aumento en la densidad para conseguir soluciones constructivas que cumplan, altos requisitos frente al fuego y una capacidad reducida de absorción de agua. Reacción al fuego: EUROCLASE A1. Sistema de galces desiguales: las placas encajan entre ellas dejando una entrecalle de 3 mm por donde se inserta la pasta de juntas. Este sistema no utiliza cinta de papel. La pasta de juntas se aplica en las cavidades de las placas y una masilla elástica en los encuentros. Atornillada a cada lado de una estructura metálica de acero galvanizado formada por canales de 50 mm y montantes de 51x49x49 mm con una modulación de 400 mm entre ejes, dando un ancho total de tabique de 79 mm. Incluida parte proporcional del resto de materiales: tornillería, pasta de juntas, masilla para encuentros perimetrales, fijaciones, junta estanca, etc. Montaje según norma de instalación UNE 102043 y exigencias del CTE."]
[null,null,44940,"1.1.12","TABIQUE ATT® 89/400 (49)  [20+49+20]",400,49,20,"Tabique formado por una placa BASIC de 20 mm de espesor compuesta por yeso natural, fibra de vidrio y aditivos inorgánicos que le aportan alta dureza y resistencia mecánica. Reacción al fuego: EUROCLASE A1. Sistema de galces desiguales: las placas encajan entre ellas dejando una entrecalle de 3 mm por donde se inserta la pasta de juntas. Este sistema no utiliza cinta de papel. La pasta de juntas se aplica en las cavidades de las placas y una masilla elástica en los encuentros. Atornillada a cada lado de una estructura metálica de acero galvanizado formada por canales de 50 mm y montantes de 51x49x49 mm con una modulación de 400 mm entre ejes, dando un ancho total de tabique de 89 mm. Incluida parte proporcional del resto de materiales: tornillería, pasta de juntas, masilla para encuentros perimetrales, fijaciones, junta estanca, etc. Montaje según norma de instalación UNE 102043 y exigencias del CTE.","Tabique formado por una placa HIDRO de 20 mm de espesor compuesta por yeso natural, fibra de vidrio y aditivos inorgánicos que le aportan alta dureza y resistencia mecánica. Incorpora tratamiento hidrófugo, disminuyendo así su capacidad de absorción de agua (menor al 5%). Idónea para proteger las estancias de los efectos adversos de la humedad. Reacción al fuego: EUROCLASE A1. Sistema de galces desiguales: las placas encajan entre ellas dejando una entrecalle de 3 mm por donde se inserta la pasta de juntas. Este sistema no utiliza cinta de papel. La pasta de juntas se aplica en las cavidades de las placas y una masilla elástica en los encuentros. Atornillada a cada lado de una estructura metálica de acero galvanizado formada por canales de 50 mm y montantes de 51x49x49 mm con una modulación de 400 mm entre ejes, dando un ancho total de tabique de 89 mm. Incluida parte proporcional del resto de materiales: tornillería, pasta de juntas, masilla para encuentros perimetrales, fijaciones, junta estanca, etc. Montaje según norma de instalación UNE 102043 y exigencias del CTE.","Tabique formado por una placa FUEGO de 20 mm de espesor compuesta por yeso natural, fibra de vidrio y aditivos inorgánicos que le aportan alta dureza y resistencia mecánica. Incorpora perlita y un aumento en la densidad que la hace idónea para un excelente comportamiento y resistencia frente al fuego. Reacción al fuego: EUROCLASE A1. Sistema de galces desiguales: las placas encajan entre ellas dejando una entrecalle de 3 mm por donde se inserta la pasta de juntas. Este sistema no utiliza cinta de papel. La pasta de juntas se aplica en las cavidades de las placas y una masilla elástica en los encuentros. Atornillada a cada lado de una estructura metálica de acero galvanizado formada por canales de 50 mm y montantes de 51x49x49 mm con una modulación de 400 mm entre ejes, dando un ancho total de tabique de 89 mm. Incluida parte proporcional del resto de materiales: tornillería, pasta de juntas, masilla para encuentros perimetrales, fijaciones, junta estanca, etc. Montaje según norma de instalación UNE 102043 y exigencias del CTE.","Tabique formado por una placa RESIST de 20 mm de espesor compuesta por yeso natural, fibra de vidrio y aditivos inorgánicos que le aportan alta dureza y resistencia mecánica. Con mayor cantidad de fibra de vidrio y dosificación modificada, aumenta su densidad, mejorando notablemente la resistencia mecánica. Idónea para lugares con altas exigencias en cuanto a deterioro y desgaste. Reacción al fuego: EUROCLASE A1. Sistema de galces desiguales: las placas encajan entre ellas dejando una entrecalle de 3 mm por donde se inserta la pasta de juntas. Este sistema no utiliza cinta de papel. La pasta de juntas se aplica en las cavidades de las placas y una masilla elástica en los encuentros. Atornillada a cada lado de una estructura metálica de acero galvanizado formada por canales de 50 mm y montantes de 51x49x49 mm con una modulación de 400 mm entre ejes, dando un ancho total de tabique de 89 mm. Incluida parte proporcional del resto de materiales: tornillería, pasta de juntas, masilla para encuentros perimetrales, fijaciones, junta estanca, etc. Montaje según norma de instalación UNE 102043 y exigencias del CTE.","Tabique formado por una placa HIDROPLUS de 20 mm de espesor compuesta por yeso natural, fibra de vidrio y aditivos inorgánicos que le aportan alta dureza y resistencia mecánica. Incorpora tratamiento hidrófugo y un aumento en su densidad, características claves para una elevada resistencia a la humedad (absorción de agua menor al 3%) y una gran resistencia mecánica. Idónea para zonas de intemperie. Reacción al fuego: EUROCLASE A1. Sistema de galces desiguales: las placas encajan entre ellas dejando una entrecalle de 3 mm por donde se inserta la pasta de juntas. Este sistema no utiliza cinta de papel. La pasta de juntas se aplica en las cavidades de las placas y una masilla elástica en los encuentros. Atornillada a cada lado de una estructura metálica de acero galvanizado formada por canales de 50 mm y montantes de 51x49x49 mm con una modulación de 400 mm entre ejes, dando un ancho total de tabique de 89 mm. Incluida parte proporcional del resto de materiales: tornillería, pasta de juntas, masilla para encuentros perimetrales, fijaciones, junta estanca, etc. Montaje según norma de instalación UNE 102043 y exigencias del CTE.","Tabique formado por una placa SUPREM de 20 mm de espesor compuesta por yeso natural, fibra de vidrio y aditivos inorgánicos que le aportan alta dureza y resistencia mecánica. Incorpora tratamiento hidrófugo, perlita y un aumento en la densidad para conseguir soluciones constructivas que cumplan, altos requisitos frente al fuego y una capacidad reducida de absorción de agua. Reacción al fuego: EUROCLASE A1. Sistema de galces desiguales: las placas encajan entre ellas dejando una entrecalle de 3 mm por donde se inserta la pasta de juntas. Este sistema no utiliza cinta de papel. La pasta de juntas se aplica en las cavidades de las placas y una masilla elástica en los encuentros. Atornillada a cada lado de una estructura metálica de acero galvanizado formada por canales de 50 mm y montantes de 51x49x49 mm con una modulación de 400 mm entre ejes, dando un ancho total de tabique de 89 mm. Incluida parte proporcional del resto de materiales: tornillería, pasta de juntas, masilla para encuentros perimetrales, fijaciones, junta estanca, etc. Montaje según norma de instalación UNE 102043 y exigencias del CTE."]
[null,null,47426,"1.1.13","TABIQUE ATT® 100/400 (74)  [13+74+13]",400,74,13,"Tabique formado por una placa BASIC de 13 mm de espesor compuesta por yeso natural, fibra de vidrio y aditivos inorgánicos que le aportan alta dureza y resistencia mecánica. Reacción al fuego: EUROCLASE A1. Sistema de galces desiguales: las placas encajan entre ellas dejando una entrecalle de 3 mm por donde se inserta la pasta de juntas. Este sistema no utiliza cinta de papel. La pasta de juntas se aplica en las cavidades de las placas y una masilla elástica en los encuentros. Atornillada a cada lado de una estructura metálica de acero galvanizado formada por canales de 75 mm y montantes de 51x74x49 mm con una modulación de 400 mm entre ejes, dando un ancho total de tabique de 100 mm. Incluida parte proporcional del resto de materiales: tornillería, pasta de juntas, masilla para encuentros perimetrales, fijaciones, junta estanca, etc. Montaje según norma de instalación UNE 102043 y exigencias del CTE.","Tabique formado por una placa HIDRO de 13 mm de espesor compuesta por yeso natural, fibra de vidrio y aditivos inorgánicos que le aportan alta dureza y resistencia mecánica. Incorpora tratamiento hidrófugo, disminuyendo así su capacidad de absorción de agua (menor al 5%). Idónea para proteger las estancias de los efectos adversos de la humedad. Reacción al fuego: EUROCLASE A1. Sistema de galces desiguales: las placas encajan entre ellas dejando una entrecalle de 3 mm por donde se inserta la pasta de juntas. Este sistema no utiliza cinta de papel. La pasta de juntas se aplica en las cavidades de las placas y una masilla elástica en los encuentros. Atornillada a cada lado de una estructura metálica de acero galvanizado formada por canales de 75 mm y montantes de 51x74x49 mm con una modulación de 400 mm entre ejes, dando un ancho total de tabique de 100 mm. Incluida parte proporcional del resto de materiales: tornillería, pasta de juntas, masilla para encuentros perimetrales, fijaciones, junta estanca, etc. Montaje según norma de instalación UNE 102043 y exigencias del CTE.","Tabique formado por una placa FUEGO de 13 mm de espesor compuesta por yeso natural, fibra de vidrio y aditivos inorgánicos que le aportan alta dureza y resistencia mecánica. Incorpora perlita y un aumento en la densidad que la hace idónea para un excelente comportamiento y resistencia frente al fuego. Reacción al fuego: EUROCLASE A1. Sistema de galces desiguales: las placas encajan entre ellas dejando una entrecalle de 3 mm por donde se inserta la pasta de juntas. Este sistema no utiliza cinta de papel. La pasta de juntas se aplica en las cavidades de las placas y una masilla elástica en los encuentros. Atornillada a cada lado de una estructura metálica de acero galvanizado formada por canales de 75 mm y montantes de 51x74x49 mm con una modulación de 400 mm entre ejes, dando un ancho total de tabique de 100 mm. Incluida parte proporcional del resto de materiales: tornillería, pasta de juntas, masilla para encuentros perimetrales, fijaciones, junta estanca, etc. Montaje según norma de instalación UNE 102043 y exigencias del CTE.","Tabique formado por una placa RESIST de 13 mm de espesor compuesta por yeso natural, fibra de vidrio y aditivos inorgánicos que le aportan alta dureza y resistencia mecánica. Con mayor cantidad de fibra de vidrio y dosificación modificada, aumenta su densidad, mejorando notablemente la resistencia mecánica. Idónea para lugares con altas exigencias en cuanto a deterioro y desgaste. Reacción al fuego: EUROCLASE A1. Sistema de galces desiguales: las placas encajan entre ellas dejando una entrecalle de 3 mm por donde se inserta la pasta de juntas. Este sistema no utiliza cinta de papel. La pasta de juntas se aplica en las cavidades de las placas y una masilla elástica en los encuentros. Atornillada a cada lado de una estructura metálica de acero galvanizado formada por canales de 75 mm y montantes de 51x74x49 mm con una modulación de 400 mm entre ejes, dando un ancho total de tabique de 100 mm. Incluida parte proporcional del resto de materiales: tornillería, pasta de juntas, masilla para encuentros perimetrales, fijaciones, junta estanca, etc. Montaje según norma de instalación UNE 102043 y exigencias del CTE.","Tabique formado por una placa HIDROPLUS de 13 mm de espesor compuesta por yeso natural, fibra de vidrio y aditivos inorgánicos que le aportan alta dureza y resistencia mecánica. Incorpora tratamiento hidrófugo y un aumento en su densidad, características claves para una elevada resistencia a la humedad (absorción de agua menor al 3%) y una gran resistencia mecánica. Idónea para zonas de intemperie. Reacción al fuego: EUROCLASE A1. Sistema de galces desiguales: las placas encajan entre ellas dejando una entrecalle de 3 mm por donde se inserta la pasta de juntas. Este sistema no utiliza cinta de papel. La pasta de juntas se aplica en las cavidades de las placas y una masilla elástica en los encuentros. Atornillada a cada lado de una estructura metálica de acero galvanizado formada por canales de 75 mm y montantes de 51x74x49 mm con una modulación de 400 mm entre ejes, dando un ancho total de tabique de 100 mm. Incluida parte proporcional del resto de materiales: tornillería, pasta de juntas, masilla para encuentros perimetrales, fijaciones, junta estanca, etc. Montaje según norma de instalación UNE 102043 y exigencias del CTE.","Tabique formado por una placa SUPREM de 13 mm de espesor compuesta por yeso natural, fibra de vidrio y aditivos inorgánicos que le aportan alta dureza y resistencia mecánica. Incorpora tratamiento hidrófugo, perlita y un aumento en la densidad para conseguir soluciones constructivas que cumplan, altos requisitos frente al fuego y una capacidad reducida de absorción de agua. Reacción al fuego: EUROCLASE A1. Sistema de galces desiguales: las placas encajan entre ellas dejando una entrecalle de 3 mm por donde se inserta la pasta de juntas. Este sistema no utiliza cinta de papel. La pasta de juntas se aplica en las cavidades de las placas y una masilla elástica en los encuentros. Atornillada a cada lado de una estructura metálica de acero galvanizado formada por canales de 75 mm y montantes de 51x74x49 mm con una modulación de 400 mm entre ejes, dando un ancho total de tabique de 100 mm. Incluida parte proporcional del resto de materiales: tornillería, pasta de juntas, masilla para encuentros perimetrales, fijaciones, junta estanca, etc. Montaje según norma de instalación UNE 102043 y exigencias del CTE."]
[null,null,47430,"1.1.14","TABIQUE ATT® 104/400 (74)  [15+74+15]",400,74,15,"Tabique formado por una placa BASIC de 15 mm de espesor compuesta por yeso natural, fibra de vidrio y aditivos inorgánicos que le aportan alta dureza y resistencia mecánica. Reacción al fuego: EUROCLASE A1. Sistema de galces desiguales: las placas encajan entre ellas dejando una entrecalle de 3 mm por donde se inserta la pasta de juntas. Este sistema no utiliza cinta de papel. La pasta de juntas se aplica en las cavidades de las placas y una masilla elástica en los encuentros. Atornillada a cada lado de una estructura metálica de acero galvanizado formada por canales de 75 mm y montantes de 51x74x49 mm con una modulación de 400 mm entre ejes, dando un ancho total de tabique de 104 mm. Incluida parte proporcional del resto de materiales: tornillería, pasta de juntas, masilla para encuentros perimetrales, fijaciones, junta estanca, etc. Montaje según norma de instalación UNE 102043 y exigencias del CTE.","Tabique formado por una placa HIDRO de 15 mm de espesor compuesta por yeso natural, fibra de vidrio y aditivos inorgánicos que le aportan alta dureza y resistencia mecánica. Incorpora tratamiento hidrófugo, disminuyendo así su capacidad de absorción de agua (menor al 5%). Idónea para proteger las estancias de los efectos adversos de la humedad. Reacción al fuego: EUROCLASE A1. Sistema de galces desiguales: las placas encajan entre ellas dejando una entrecalle de 3 mm por donde se inserta la pasta de juntas. Este sistema no utiliza cinta de papel. La pasta de juntas se aplica en las cavidades de las placas y una masilla elástica en los encuentros. Atornillada a cada lado de una estructura metálica de acero galvanizado formada por canales de 75 mm y montantes de 51x74x49 mm con una modulación de 400 mm entre ejes, dando un ancho total de tabique de 104 mm. Incluida parte proporcional del resto de materiales: tornillería, pasta de juntas, masilla para encuentros perimetrales, fijaciones, junta estanca, etc. Montaje según norma de instalación UNE 102043 y exigencias del CTE.","Tabique formado por una placa FUEGO de 15 mm de espesor compuesta por yeso natural, fibra de vidrio y aditivos inorgánicos que le aportan alta dureza y resistencia mecánica. Incorpora perlita y un aumento en la densidad que la hace idónea para un excelente comportamiento y resistencia frente al fuego. Reacción al fuego: EUROCLASE A1. Sistema de galces desiguales: las placas encajan entre ellas dejando una entrecalle de 3 mm por donde se inserta la pasta de juntas. Este sistema no utiliza cinta de papel. La pasta de juntas se aplica en las cavidades de las placas y una masilla elástica en los encuentros. Atornillada a cada lado de una estructura metálica de acero galvanizado formada por canales de 75 mm y montantes de 51x74x49 mm con una modulación de 400 mm entre ejes, dando un ancho total de tabique de 104 mm. Incluida parte proporcional del resto de materiales: tornillería, pasta de juntas, masilla para encuentros perimetrales, fijaciones, junta estanca, etc. Montaje según norma de instalación UNE 102043 y exigencias del CTE.","Tabique formado por una placa RESIST de 15 mm de espesor compuesta por yeso natural, fibra de vidrio y aditivos inorgánicos que le aportan alta dureza y resistencia mecánica. Con mayor cantidad de fibra de vidrio y dosificación modificada, aumenta su densidad, mejorando notablemente la resistencia mecánica. Idónea para lugares con altas exigencias en cuanto a deterioro y desgaste. Reacción al fuego: EUROCLASE A1. Sistema de galces desiguales: las placas encajan entre ellas dejando una entrecalle de 3 mm por donde se inserta la pasta de juntas. Este sistema no utiliza cinta de papel. La pasta de juntas se aplica en las cavidades de las placas y una masilla elástica en los encuentros. Atornillada a cada lado de una estructura metálica de acero galvanizado formada por canales de 75 mm y montantes de 51x74x49 mm con una modulación de 400 mm entre ejes, dando un ancho total de tabique de 104 mm. Incluida parte proporcional del resto de materiales: tornillería, pasta de juntas, masilla para encuentros perimetrales, fijaciones, junta estanca, etc. Montaje según norma de instalación UNE 102043 y exigencias del CTE.","Tabique formado por una placa HIDROPLUS de 15 mm de espesor compuesta por yeso natural, fibra de vidrio y aditivos inorgánicos que le aportan alta dureza y resistencia mecánica. Incorpora tratamiento hidrófugo y un aumento en su densidad, características claves para una elevada resistencia a la humedad (absorción de agua menor al 3%) y una gran resistencia mecánica. Idónea para zonas de intemperie. Reacción al fuego: EUROCLASE A1. Sistema de galces desiguales: las placas encajan entre ellas dejando una entrecalle de 3 mm por donde se inserta la pasta de juntas. Este sistema no utiliza cinta de papel. La pasta de juntas se aplica en las cavidades de las placas y una masilla elástica en los encuentros. Atornillada a cada lado de una estructura metálica de acero galvanizado formada por canales de 75 mm y montantes de 51x74x49 mm con una modulación de 400 mm entre ejes, dando un ancho total de tabique de 104 mm. Incluida parte proporcional del resto de materiales: tornillería, pasta de juntas, masilla para encuentros perimetrales, fijaciones, junta estanca, etc. Montaje según norma de instalación UNE 102043 y exigencias del CTE.","Tabique formado por una placa SUPREM de 15 mm de espesor compuesta por yeso natural, fibra de vidrio y aditivos inorgánicos que le aportan alta dureza y resistencia mecánica. Incorpora tratamiento hidrófugo, perlita y un aumento en la densidad para conseguir soluciones constructivas que cumplan, altos requisitos frente al fuego y una capacidad reducida de absorción de agua. Reacción al fuego: EUROCLASE A1. Sistema de galces desiguales: las placas encajan entre ellas dejando una entrecalle de 3 mm por donde se inserta la pasta de juntas. Este sistema no utiliza cinta de papel. La pasta de juntas se aplica en las cavidades de las placas y una masilla elástica en los encuentros. Atornillada a cada lado de una estructura metálica de acero galvanizado formada por canales de 75 mm y montantes de 51x74x49 mm con una modulación de 400 mm entre ejes, dando un ancho total de tabique de 104 mm. Incluida parte proporcional del resto de materiales: tornillería, pasta de juntas, masilla para encuentros perimetrales, fijaciones, junta estanca, etc. Montaje según norma de instalación UNE 102043 y exigencias del CTE."]
["PLACA TRIPLE",null,47440,"1.1.15","TABIQUE ATT® 114/400 (74)  [20+74+20]",400,74,20,"Tabique formado por una placa BASIC de 20 mm de espesor compuesta por yeso natural, fibra de vidrio y aditivos inorgánicos que le aportan alta dureza y resistencia mecánica. Reacción al fuego: EUROCLASE A1. Sistema de galces desiguales: las placas encajan entre ellas dejando una entrecalle de 3 mm por donde se inserta la pasta de juntas. Este sistema no utiliza cinta de papel. La pasta de juntas se aplica en las cavidades de las placas y una masilla elástica en los encuentros. Atornillada a cada lado de una estructura metálica de acero galvanizado formada por canales de 75 mm y montantes de 51x74x49 mm con una modulación de 400 mm entre ejes, dando un ancho total de tabique de 114 mm. Incluida parte proporcional del resto de materiales: tornillería, pasta de juntas, masilla para encuentros perimetrales, fijaciones, junta estanca, etc. Montaje según norma de instalación UNE 102043 y exigencias del CTE.","Tabique formado por una placa HIDRO de 20 mm de espesor compuesta por yeso natural, fibra de vidrio y aditivos inorgánicos que le aportan alta dureza y resistencia mecánica. Incorpora tratamiento hidrófugo, disminuyendo así su capacidad de absorción de agua (menor al 5%). Idónea para proteger las estancias de los efectos adversos de la humedad. Reacción al fuego: EUROCLASE A1. Sistema de galces desiguales: las placas encajan entre ellas dejando una entrecalle de 3 mm por donde se inserta la pasta de juntas. Este sistema no utiliza cinta de papel. La pasta de juntas se aplica en las cavidades de las placas y una masilla elástica en los encuentros. Atornillada a cada lado de una estructura metálica de acero galvanizado formada por canales de 75 mm y montantes de 51x74x49 mm con una modulación de 400 mm entre ejes, dando un ancho total de tabique de 114 mm. Incluida parte proporcional del resto de materiales: tornillería, pasta de juntas, masilla para encuentros perimetrales, fijaciones, junta estanca, etc. Montaje según norma de instalación UNE 102043 y exigencias del CTE.","Tabique formado por una placa FUEGO de 20 mm de espesor compuesta por yeso natural, fibra de vidrio y aditivos inorgánicos que le aportan alta dureza y resistencia mecánica. Incorpora perlita y un aumento en la densidad que la hace idónea para un excelente comportamiento y resistencia frente al fuego. Reacción al fuego: EUROCLASE A1. Sistema de galces desiguales: las placas encajan entre ellas dejando una entrecalle de 3 mm por donde se inserta la pasta de juntas. Este sistema no utiliza cinta de papel. La pasta de juntas se aplica en las cavidades de las placas y una masilla elástica en los encuentros. Atornillada a cada lado de una estructura metálica de acero galvanizado formada por canales de 75 mm y montantes de 51x74x49 mm con una modulación de 400 mm entre ejes, dando un ancho total de tabique de 114 mm. Incluida parte proporcional del resto de materiales: tornillería, pasta de juntas, masilla para encuentros perimetrales, fijaciones, junta estanca, etc. Montaje según norma de instalación UNE 102043 y exigencias del CTE.","Tabique formado por una placa RESIST de 20 mm de espesor compuesta por yeso natural, fibra de vidrio y aditivos inorgánicos que le aportan alta dureza y resistencia mecánica. Con mayor cantidad de fibra de vidrio y dosificación modificada, aumenta su densidad, mejorando notablemente la resistencia mecánica. Idónea para lugares con altas exigencias en cuanto a deterioro y desgaste. Reacción al fuego: EUROCLASE A1. Sistema de galces desiguales: las placas encajan entre ellas dejando una entrecalle de 3 mm por donde se inserta la pasta de juntas. Este sistema no utiliza cinta de papel. La pasta de juntas se aplica en las cavidades de las placas y una masilla elástica en los encuentros. Atornillada a cada lado de una estructura metálica de acero galvanizado formada por canales de 75 mm y montantes de 51x74x49 mm con una modulación de 400 mm entre ejes, dando un ancho total de tabique de 114 mm. Incluida parte proporcional del resto de materiales: tornillería, pasta de juntas, masilla para encuentros perimetrales, fijaciones, junta estanca, etc. Montaje según norma de instalación UNE 102043 y exigencias del CTE.","Tabique formado por una placa HIDROPLUS de 20 mm de espesor compuesta por yeso natural, fibra de vidrio y aditivos inorgánicos que le aportan alta dureza y resistencia mecánica. Incorpora tratamiento hidrófugo y un aumento en su densidad, características claves para una elevada resistencia a la humedad (absorción de agua menor al 3%) y una gran resistencia mecánica. Idónea para zonas de intemperie. Reacción al fuego: EUROCLASE A1. Sistema de galces desiguales: las placas encajan entre ellas dejando una entrecalle de 3 mm por donde se inserta la pasta de juntas. Este sistema no utiliza cinta de papel. La pasta de juntas se aplica en las cavidades de las placas y una masilla elástica en los encuentros. Atornillada a cada lado de una estructura metálica de acero galvanizado formada por canales de 75 mm y montantes de 51x74x49 mm con una modulación de 400 mm entre ejes, dando un ancho total de tabique de 114 mm. Incluida parte proporcional del resto de materiales: tornillería, pasta de juntas, masilla para encuentros perimetrales, fijaciones, junta estanca, etc. Montaje según norma de instalación UNE 102043 y exigencias del CTE.","Tabique formado por una placa SUPREM de 20 mm de espesor compuesta por yeso natural, fibra de vidrio y aditivos inorgánicos que le aportan alta dureza y resistencia mecánica. Incorpora tratamiento hidrófugo, perlita y un aumento en la densidad para conseguir soluciones constructivas que cumplan, altos requisitos frente al fuego y una capacidad reducida de absorción de agua. Reacción al fuego: EUROCLASE A1. Sistema de galces desiguales: las placas encajan entre ellas dejando una entrecalle de 3 mm por donde se inserta la pasta de juntas. Este sistema no utiliza cinta de papel. La pasta de juntas se aplica en las cavidades de las placas y una masilla elástica en los encuentros. Atornillada a cada lado de una estructura metálica de acero galvanizado formada por canales de 75 mm y montantes de 51x74x49 mm con una modulación de 400 mm entre ejes, dando un ancho total de tabique de 114 mm. Incluida parte proporcional del resto de materiales: tornillería, pasta de juntas, masilla para encuentros perimetrales, fijaciones, junta estanca, etc. Montaje según norma de instalación UNE 102043 y exigencias del CTE."]
[null,null,49926,"1.1.16","TABIQUE ATT® 125/400 (99)  [13+99+13]",400,99,13,"Tabique formado por una placa BASIC de 13 mm de espesor compuesta por yeso natural, fibra de vidrio y aditivos inorgánicos que le aportan alta dureza y resistencia mecánica. Reacción al fuego: EUROCLASE A1. Sistema de galces desiguales: las placas encajan entre ellas dejando una entrecalle de 3 mm por donde se inserta la pasta de juntas. Este sistema no utiliza cinta de papel. La pasta de juntas se aplica en las cavidades de las placas y una masilla elástica en los encuentros. Atornillada a cada lado de una estructura metálica de acero galvanizado formada por canales de 100 mm y montantes de 51x99x49 mm con una modulación de 400 mm entre ejes, dando un ancho total de tabique de 125 mm. Incluida parte proporcional del resto de materiales: tornillería, pasta de juntas, masilla para encuentros perimetrales, fijaciones, junta estanca, etc. Montaje según norma de instalación UNE 102043 y exigencias del CTE.","Tabique formado por una placa HIDRO de 13 mm de espesor compuesta por yeso natural, fibra de vidrio y aditivos inorgánicos que le aportan alta dureza y resistencia mecánica. Incorpora tratamiento hidrófugo, disminuyendo así su capacidad de absorción de agua (menor al 5%). Idónea para proteger las estancias de los efectos adversos de la humedad. Reacción al fuego: EUROCLASE A1. Sistema de galces desiguales: las placas encajan entre ellas dejando una entrecalle de 3 mm por donde se inserta la pasta de juntas. Este sistema no utiliza cinta de papel. La pasta de juntas se aplica en las cavidades de las placas y una masilla elástica en los encuentros. Atornillada a cada lado de una estructura metálica de acero galvanizado formada por canales de 100 mm y montantes de 51x99x49 mm con una modulación de 400 mm entre ejes, dando un ancho total de tabique de 125 mm. Incluida parte proporcional del resto de materiales: tornillería, pasta de juntas, masilla para encuentros perimetrales, fijaciones, junta estanca, etc. Montaje según norma de instalación UNE 102043 y exigencias del CTE.","Tabique formado por una placa FUEGO de 13 mm de espesor compuesta por yeso natural, fibra de vidrio y aditivos inorgánicos que le aportan alta dureza y resistencia mecánica. Incorpora perlita y un aumento en la densidad que la hace idónea para un excelente comportamiento y resistencia frente al fuego. Reacción al fuego: EUROCLASE A1. Sistema de galces desiguales: las placas encajan entre ellas dejando una entrecalle de 3 mm por donde se inserta la pasta de juntas. Este sistema no utiliza cinta de papel. La pasta de juntas se aplica en las cavidades de las placas y una masilla elástica en los encuentros. Atornillada a cada lado de una estructura metálica de acero galvanizado formada por canales de 100 mm y montantes de 51x99x49 mm con una modulación de 400 mm entre ejes, dando un ancho total de tabique de 125 mm. Incluida parte proporcional del resto de materiales: tornillería, pasta de juntas, masilla para encuentros perimetrales, fijaciones, junta estanca, etc. Montaje según norma de instalación UNE 102043 y exigencias del CTE.","Tabique formado por una placa RESIST de 13 mm de espesor compuesta por yeso natural, fibra de vidrio y aditivos inorgánicos que le aportan alta dureza y resistencia mecánica. Con mayor cantidad de fibra de vidrio y dosificación modificada, aumenta su densidad, mejorando notablemente la resistencia mecánica. Idónea para lugares con altas exigencias en cuanto a deterioro y desgaste. Reacción al fuego: EUROCLASE A1. Sistema de galces desiguales: las placas encajan entre ellas dejando una entrecalle de 3 mm por donde se inserta la pasta de juntas. Este sistema no utiliza cinta de papel. La pasta de juntas se aplica en las cavidades de las placas y una masilla elástica en los encuentros. Atornillada a cada lado de una estructura metálica de acero galvanizado formada por canales de 100 mm y montantes de 51x99x49 mm con una modulación de 400 mm entre ejes, dando un ancho total de tabique de 125 mm. Incluida parte proporcional del resto de materiales: tornillería, pasta de juntas, masilla para encuentros perimetrales, fijaciones, junta estanca, etc. Montaje según norma de instalación UNE 102043 y exigencias del CTE.","Tabique formado por una placa HIDROPLUS de 13 mm de espesor compuesta por yeso natural, fibra de vidrio y aditivos inorgánicos que le aportan alta dureza y resistencia mecánica. Incorpora tratamiento hidrófugo y un aumento en su densidad, características claves para una elevada resistencia a la humedad (absorción de agua menor al 3%) y una gran resistencia mecánica. Idónea para zonas de intemperie. Reacción al fuego: EUROCLASE A1. Sistema de galces desiguales: las placas encajan entre ellas dejando una entrecalle de 3 mm por donde se inserta la pasta de juntas. Este sistema no utiliza cinta de papel. La pasta de juntas se aplica en las cavidades de las placas y una masilla elástica en los encuentros. Atornillada a cada lado de una estructura metálica de acero galvanizado formada por canales de 100 mm y montantes de 51x99x49 mm con una modulación de 400 mm entre ejes, dando un ancho total de tabique de 125 mm. Incluida parte proporcional del resto de materiales: tornillería, pasta de juntas, masilla para encuentros perimetrales, fijaciones, junta estanca, etc. Montaje según norma de instalación UNE 102043 y exigencias del CTE.","Tabique formado por una placa SUPREM de 13 mm de espesor compuesta por yeso natural, fibra de vidrio y aditivos inorgánicos que le aportan alta dureza y resistencia mecánica. Incorpora tratamiento hidrófugo, perlita y un aumento en la densidad para conseguir soluciones constructivas que cumplan, altos requisitos frente al fuego y una capacidad reducida de absorción de agua. Reacción al fuego: EUROCLASE A1. Sistema de galces desiguales: las placas encajan entre ellas dejando una entrecalle de 3 mm por donde se inserta la pasta de juntas. Este sistema no utiliza cinta de papel. La pasta de juntas se aplica en las cavidades de las placas y una masilla elástica en los encuentros. Atornillada a cada lado de una estructura metálica de acero galvanizado formada por canales de 100 mm y montantes de 51x99x49 mm con una modulación de 400 mm entre ejes, dando un ancho total de tabique de 125 mm. Incluida parte proporcional del resto de materiales: tornillería, pasta de juntas, masilla para encuentros perimetrales, fijaciones, junta estanca, etc. Montaje según norma de instalación UNE 102043 y exigencias del CTE."]
[null,null,49930,"1.1.17","TABIQUE ATT® 129/400 (99)  [15+99+15]",400,99,15,"Tabique formado por una placa BASIC de 15 mm de espesor compuesta por yeso natural, fibra de vidrio y aditivos inorgánicos que le aportan alta dureza y resistencia mecánica. Reacción al fuego: EUROCLASE A1. Sistema de galces desiguales: las placas encajan entre ellas dejando una entrecalle de 3 mm por donde se inserta la pasta de juntas. Este sistema no utiliza cinta de papel. La pasta de juntas se aplica en las cavidades de las placas y una masilla elástica en los encuentros. Atornillada a cada lado de una estructura metálica de acero galvanizado formada por canales de 100 mm y montantes de 51x99x49 mm con una modulación de 400 mm entre ejes, dando un ancho total de tabique de 129 mm. Incluida parte proporcional del resto de materiales: tornillería, pasta de juntas, masilla para encuentros perimetrales, fijaciones, junta estanca, etc. Montaje según norma de instalación UNE 102043 y exigencias del CTE.","Tabique formado por una placa HIDRO de 15 mm de espesor compuesta por yeso natural, fibra de vidrio y aditivos inorgánicos que le aportan alta dureza y resistencia mecánica. Incorpora tratamiento hidrófugo, disminuyendo así su capacidad de absorción de agua (menor al 5%). Idónea para proteger las estancias de los efectos adversos de la humedad. Reacción al fuego: EUROCLASE A1. Sistema de galces desiguales: las placas encajan entre ellas dejando una entrecalle de 3 mm por donde se inserta la pasta de juntas. Este sistema no utiliza cinta de papel. La pasta de juntas se aplica en las cavidades de las placas y una masilla elástica en los encuentros. Atornillada a cada lado de una estructura metálica de acero galvanizado formada por canales de 100 mm y montantes de 51x99x49 mm con una modulación de 400 mm entre ejes, dando un ancho total de tabique de 129 mm. Incluida parte proporcional del resto de materiales: tornillería, pasta de juntas, masilla para encuentros perimetrales, fijaciones, junta estanca, etc. Montaje según norma de instalación UNE 102043 y exigencias del CTE.","Tabique formado por una placa FUEGO de 15 mm de espesor compuesta por yeso natural, fibra de vidrio y aditivos inorgánicos que le aportan alta dureza y resistencia mecánica. Incorpora perlita y un aumento en la densidad que la hace idónea para un excelente comportamiento y resistencia frente al fuego. Reacción al fuego: EUROCLASE A1. Sistema de galces desiguales: las placas encajan entre ellas dejando una entrecalle de 3 mm por donde se inserta la pasta de juntas. Este sistema no utiliza cinta de papel. La pasta de juntas se aplica en las cavidades de las placas y una masilla elástica en los encuentros. Atornillada a cada lado de una estructura metálica de acero galvanizado formada por canales de 100 mm y montantes de 51x99x49 mm con una modulación de 400 mm entre ejes, dando un ancho total de tabique de 129 mm. Incluida parte proporcional del resto de materiales: tornillería, pasta de juntas, masilla para encuentros perimetrales, fijaciones, junta estanca, etc. Montaje según norma de instalación UNE 102043 y exigencias del CTE.","Tabique formado por una placa RESIST de 15 mm de espesor compuesta por yeso natural, fibra de vidrio y aditivos inorgánicos que le aportan alta dureza y resistencia mecánica. Con mayor cantidad de fibra de vidrio y dosificación modificada, aumenta su densidad, mejorando notablemente la resistencia mecánica. Idónea para lugares con altas exigencias en cuanto a deterioro y desgaste. Reacción al fuego: EUROCLASE A1. Sistema de galces desiguales: las placas encajan entre ellas dejando una entrecalle de 3 mm por donde se inserta la pasta de juntas. Este sistema no utiliza cinta de papel. La pasta de juntas se aplica en las cavidades de las placas y una masilla elástica en los encuentros. Atornillada a cada lado de una estructura metálica de acero galvanizado formada por canales de 100 mm y montantes de 51x99x49 mm con una modulación de 400 mm entre ejes, dando un ancho total de tabique de 129 mm. Incluida parte proporcional del resto de materiales: tornillería, pasta de juntas, masilla para encuentros perimetrales, fijaciones, junta estanca, etc. Montaje según norma de instalación UNE 102043 y exigencias del CTE.","Tabique formado por una placa HIDROPLUS de 15 mm de espesor compuesta por yeso natural, fibra de vidrio y aditivos inorgánicos que le aportan alta dureza y resistencia mecánica. Incorpora tratamiento hidrófugo y un aumento en su densidad, características claves para una elevada resistencia a la humedad (absorción de agua menor al 3%) y una gran resistencia mecánica. Idónea para zonas de intemperie. Reacción al fuego: EUROCLASE A1. Sistema de galces desiguales: las placas encajan entre ellas dejando una entrecalle de 3 mm por donde se inserta la pasta de juntas. Este sistema no utiliza cinta de papel. La pasta de juntas se aplica en las cavidades de las placas y una masilla elástica en los encuentros. Atornillada a cada lado de una estructura metálica de acero galvanizado formada por canales de 100 mm y montantes de 51x99x49 mm con una modulación de 400 mm entre ejes, dando un ancho total de tabique de 129 mm. Incluida parte proporcional del resto de materiales: tornillería, pasta de juntas, masilla para encuentros perimetrales, fijaciones, junta estanca, etc. Montaje según norma de instalación UNE 102043 y exigencias del CTE.","Tabique formado por una placa SUPREM de 15 mm de espesor compuesta por yeso natural, fibra de vidrio y aditivos inorgánicos que le aportan alta dureza y resistencia mecánica. Incorpora tratamiento hidrófugo, perlita y un aumento en la densidad para conseguir soluciones constructivas que cumplan, altos requisitos frente al fuego y una capacidad reducida de absorción de agua. Reacción al fuego: EUROCLASE A1. Sistema de galces desiguales: las placas encajan entre ellas dejando una entrecalle de 3 mm por donde se inserta la pasta de juntas. Este sistema no utiliza cinta de papel. La pasta de juntas se aplica en las cavidades de las placas y una masilla elástica en los encuentros. Atornillada a cada lado de una estructura metálica de acero galvanizado formada por canales de 100 mm y montantes de 51x99x49 mm con una modulación de 400 mm entre ejes, dando un ancho total de tabique de 129 mm. Incluida parte proporcional del resto de materiales: tornillería, pasta de juntas, masilla para encuentros perimetrales, fijaciones, junta estanca, etc. Montaje según norma de instalación UNE 102043 y exigencias del CTE."]
[null,null,49940,"1.1.18","TABIQUE ATT® 139/400 (99)  [20+99+20]",400,99,20,"Tabique formado por una placa BASIC de 20 mm de espesor compuesta por yeso natural, fibra de vidrio y aditivos inorgánicos que le aportan alta dureza y resistencia mecánica. Reacción al fuego: EUROCLASE A1. Sistema de galces desiguales: las placas encajan entre ellas dejando una entrecalle de 3 mm por donde se inserta la pasta de juntas. Este sistema no utiliza cinta de papel. La pasta de juntas se aplica en las cavidades de las placas y una masilla elástica en los encuentros. Atornillada a cada lado de una estructura metálica de acero galvanizado formada por canales de 100 mm y montantes de 51x99x49 mm con una modulación de 400 mm entre ejes, dando un ancho total de tabique de 139 mm. Incluida parte proporcional del resto de materiales: tornillería, pasta de juntas, masilla para encuentros perimetrales, fijaciones, junta estanca, etc. Montaje según norma de instalación UNE 102043 y exigencias del CTE.","Tabique formado por una placa HIDRO de 20 mm de espesor compuesta por yeso natural, fibra de vidrio y aditivos inorgánicos que le aportan alta dureza y resistencia mecánica. Incorpora tratamiento hidrófugo, disminuyendo así su capacidad de absorción de agua (menor al 5%). Idónea para proteger las estancias de los efectos adversos de la humedad. Reacción al fuego: EUROCLASE A1. Sistema de galces desiguales: las placas encajan entre ellas dejando una entrecalle de 3 mm por donde se inserta la pasta de juntas. Este sistema no utiliza cinta de papel. La pasta de juntas se aplica en las cavidades de las placas y una masilla elástica en los encuentros. Atornillada a cada lado de una estructura metálica de acero galvanizado formada por canales de 100 mm y montantes de 51x99x49 mm con una modulación de 400 mm entre ejes, dando un ancho total de tabique de 139 mm. Incluida parte proporcional del resto de materiales: tornillería, pasta de juntas, masilla para encuentros perimetrales, fijaciones, junta estanca, etc. Montaje según norma de instalación UNE 102043 y exigencias del CTE.","Tabique formado por una placa FUEGO de 20 mm de espesor compuesta por yeso natural, fibra de vidrio y aditivos inorgánicos que le aportan alta dureza y resistencia mecánica. Incorpora perlita y un aumento en la densidad que la hace idónea para un excelente comportamiento y resistencia frente al fuego. Reacción al fuego: EUROCLASE A1. Sistema de galces desiguales: las placas encajan entre ellas dejando una entrecalle de 3 mm por donde se inserta la pasta de juntas. Este sistema no utiliza cinta de papel. La pasta de juntas se aplica en las cavidades de las placas y una masilla elástica en los encuentros. Atornillada a cada lado de una estructura metálica de acero galvanizado formada por canales de 100 mm y montantes de 51x99x49 mm con una modulación de 400 mm entre ejes, dando un ancho total de tabique de 139 mm. Incluida parte proporcional del resto de materiales: tornillería, pasta de juntas, masilla para encuentros perimetrales, fijaciones, junta estanca, etc. Montaje según norma de instalación UNE 102043 y exigencias del CTE.","Tabique formado por una placa RESIST de 20 mm de espesor compuesta por yeso natural, fibra de vidrio y aditivos inorgánicos que le aportan alta dureza y resistencia mecánica. Con mayor cantidad de fibra de vidrio y dosificación modificada, aumenta su densidad, mejorando notablemente la resistencia mecánica. Idónea para lugares con altas exigencias en cuanto a deterioro y desgaste. Reacción al fuego: EUROCLASE A1. Sistema de galces desiguales: las placas encajan entre ellas dejando una entrecalle de 3 mm por donde se inserta la pasta de juntas. Este sistema no utiliza cinta de papel. La pasta de juntas se aplica en las cavidades de las placas y una masilla elástica en los encuentros. Atornillada a cada lado de una estructura metálica de acero galvanizado formada por canales de 100 mm y montantes de 51x99x49 mm con una modulación de 400 mm entre ejes, dando un ancho total de tabique de 139 mm. Incluida parte proporcional del resto de materiales: tornillería, pasta de juntas, masilla para encuentros perimetrales, fijaciones, junta estanca, etc. Montaje según norma de instalación UNE 102043 y exigencias del CTE.","Tabique formado por una placa HIDROPLUS de 20 mm de espesor compuesta por yeso natural, fibra de vidrio y aditivos inorgánicos que le aportan alta dureza y resistencia mecánica. Incorpora tratamiento hidrófugo y un aumento en su densidad, características claves para una elevada resistencia a la humedad (absorción de agua menor al 3%) y una gran resistencia mecánica. Idónea para zonas de intemperie. Reacción al fuego: EUROCLASE A1. Sistema de galces desiguales: las placas encajan entre ellas dejando una entrecalle de 3 mm por donde se inserta la pasta de juntas. Este sistema no utiliza cinta de papel. La pasta de juntas se aplica en las cavidades de las placas y una masilla elástica en los encuentros. Atornillada a cada lado de una estructura metálica de acero galvanizado formada por canales de 100 mm y montantes de 51x99x49 mm con una modulación de 400 mm entre ejes, dando un ancho total de tabique de 139 mm. Incluida parte proporcional del resto de materiales: tornillería, pasta de juntas, masilla para encuentros perimetrales, fijaciones, junta estanca, etc. Montaje según norma de instalación UNE 102043 y exigencias del CTE.","Tabique formado por una placa SUPREM de 20 mm de espesor compuesta por yeso natural, fibra de vidrio y aditivos inorgánicos que le aportan alta dureza y resistencia mecánica. Incorpora tratamiento hidrófugo, perlita y un aumento en la densidad para conseguir soluciones constructivas que cumplan, altos requisitos frente al fuego y una capacidad reducida de absorción de agua. Reacción al fuego: EUROCLASE A1. Sistema de galces desiguales: las placas encajan entre ellas dejando una entrecalle de 3 mm por donde se inserta la pasta de juntas. Este sistema no utiliza cinta de papel. La pasta de juntas se aplica en las cavidades de las placas y una masilla elástica en los encuentros. Atornillada a cada lado de una estructura metálica de acero galvanizado formada por canales de 100 mm y montantes de 51x99x49 mm con una modulación de 400 mm entre ejes, dando un ancho total de tabique de 139 mm. Incluida parte proporcional del resto de materiales: tornillería, pasta de juntas, masilla para encuentros perimetrales, fijaciones, junta estanca, etc. Montaje según norma de instalación UNE 102043 y exigencias del CTE."]
[null,null,64952,"1.2.1","TABIQUE ATT® 101/600 (49)  [13+13+49+13+13]",600,49,26,"Tabique formado por dos placas BASIC de 13 mm de espesor compuestas por yeso natural, fibra de vidrio y aditivos inorgánicos que le aportan alta dureza y resistencia mecánica. Reacción al fuego: EUROCLASE A1. Sistema de galces desiguales: las placas encajan entre ellas dejando una entrecalle de 3 mm por donde se inserta la pasta de juntas. Este sistema no utiliza cinta de papel. La pasta de juntas se aplica en las cavidades de las placas y una masilla elástica en los encuentros. Atornillada a cada lado de una estructura metálica de acero galvanizado formada por canales de 50 mm y montantes de 51x49x49 mm con una modulación de 600 mm entre ejes, dando un ancho total de tabique de 101 mm. Incluida parte proporcional del resto de materiales: tornillería, pasta de juntas, masilla para encuentros perimetrales, fijaciones, junta estanca, etc. Montaje según norma de instalación UNE 102043 y exigencias del CTE.","Tabique formado por dos placas HIDRO de 13 mm de espesor compuestas por yeso natural, fibra de vidrio y aditivos inorgánicos que le aportan alta dureza y resistencia mecánica. Incorpora tratamiento hidrófugo, disminuyendo así su capacidad de absorción de agua (menor al 5%). Idónea para proteger las estancias de los efectos adversos de la humedad. Reacción al fuego: EUROCLASE A1. Sistema de galces desiguales: las placas encajan entre ellas dejando una entrecalle de 3 mm por donde se inserta la pasta de juntas. Este sistema no utiliza cinta de papel. La pasta de juntas se aplica en las cavidades de las placas y una masilla elástica en los encuentros. Atornillada a cada lado de una estructura metálica de acero galvanizado formada por canales de 50 mm y montantes de 51x49x49 mm con una modulación de 600 mm entre ejes, dando un ancho total de tabique de 101 mm. Incluida parte proporcional del resto de materiales: tornillería, pasta de juntas, masilla para encuentros perimetrales, fijaciones, junta estanca, etc. Montaje según norma de instalación UNE 102043 y exigencias del CTE.","Tabique formado por dos placas FUEGO de 13 mm de espesor compuestas por yeso natural, fibra de vidrio y aditivos inorgánicos que le aportan alta dureza y resistencia mecánica. Incorpora perlita y un aumento en la densidad que la hace idónea para un excelente comportamiento y resistencia frente al fuego. Reacción al fuego: EUROCLASE A1. Sistema de galces desiguales: las placas encajan entre ellas dejando una entrecalle de 3 mm por donde se inserta la pasta de juntas. Este sistema no utiliza cinta de papel. La pasta de juntas se aplica en las cavidades de las placas y una masilla elástica en los encuentros. Atornillada a cada lado de una estructura metálica de acero galvanizado formada por canales de 50 mm y montantes de 51x49x49 mm con una modulación de 600 mm entre ejes, dando un ancho total de tabique de 101 mm. Incluida parte proporcional del resto de materiales: tornillería, pasta de juntas, masilla para encuentros perimetrales, fijaciones, junta estanca, etc. Montaje según norma de instalación UNE 102043 y exigencias del CTE.","Tabique formado por dos placas RESIST de 13 mm de espesor compuestas por yeso natural, fibra de vidrio y aditivos inorgánicos que le aportan alta dureza y resistencia mecánica. Con mayor cantidad de fibra de vidrio y dosificación modificada, aumenta su densidad, mejorando notablemente la resistencia mecánica. Idónea para lugares con altas exigencias en cuanto a deterioro y desgaste. Reacción al fuego: EUROCLASE A1. Sistema de galces desiguales: las placas encajan entre ellas dejando una entrecalle de 3 mm por donde se inserta la pasta de juntas. Este sistema no utiliza cinta de papel. La pasta de juntas se aplica en las cavidades de las placas y una masilla elástica en los encuentros. Atornillada a cada lado de una estructura metálica de acero galvanizado formada por canales de 50 mm y montantes de 51x49x49 mm con una modulación de 600 mm entre ejes, dando un ancho total de tabique de 101 mm. Incluida parte proporcional del resto de materiales: tornillería, pasta de juntas, masilla para encuentros perimetrales, fijaciones, junta estanca, etc. Montaje según norma de instalación UNE 102043 y exigencias del CTE.","Tabique formado por dos placas HIDROPLUS de 13 mm de espesor compuestas por yeso natural, fibra de vidrio y aditivos inorgánicos que le aportan alta dureza y resistencia mecánica. Incorpora tratamiento hidrófugo y un aumento en su densidad, características claves para una elevada resistencia a la humedad (absorción de agua menor al 3%) y una gran resistencia mecánica. Idónea para zonas de intemperie. Reacción al fuego: EUROCLASE A1. Sistema de galces desiguales: las placas encajan entre ellas dejando una entrecalle de 3 mm por donde se inserta la pasta de juntas. Este sistema no utiliza cinta de papel. La pasta de juntas se aplica en las cavidades de las placas y una masilla elástica en los encuentros. Atornillada a cada lado de una estructura metálica de acero galvanizado formada por canales de 50 mm y montantes de 51x49x49 mm con una modulación de 600 mm entre ejes, dando un ancho total de tabique de 101 mm. Incluida parte proporcional del resto de materiales: tornillería, pasta de juntas, masilla para encuentros perimetrales, fijaciones, junta estanca, etc. Montaje según norma de instalación UNE 102043 y exigencias del CTE.","Tabique formado por dos placas SUPREM de 13 mm de espesor compuestas por yeso natural, fibra de vidrio y aditivos inorgánicos que le aportan alta dureza y resistencia mecánica. Incorpora tratamiento hidrófugo, perlita y un aumento en la densidad para conseguir soluciones constructivas que cumplan, altos requisitos frente al fuego y una capacidad reducida de absorción de agua. Reacción al fuego: EUROCLASE A1. Sistema de galces desiguales: las placas encajan entre ellas dejando una entrecalle de 3 mm por donde se inserta la pasta de juntas. Este sistema no utiliza cinta de papel. La pasta de juntas se aplica en las cavidades de las placas y una masilla elástica en los encuentros. Atornillada a cada lado de una estructura metálica de acero galvanizado formada por canales de 50 mm y montantes de 51x49x49 mm con una modulación de 600 mm entre ejes, dando un ancho total de tabique de 101 mm. Incluida parte proporcional del resto de materiales: tornillería, pasta de juntas, masilla para encuentros perimetrales, fijaciones, junta estanca, etc. Montaje según norma de instalación UNE 102043 y exigencias del CTE."]
[null,null,64960,"1.2.2","TABIQUE ATT® 109/600 (49)  [15+15+49+15+15]",600,49,30,"Tabique formado por dos placas BASIC de 15 mm de espesor compuestas por yeso natural, fibra de vidrio y aditivos inorgánicos que le aportan alta dureza y resistencia mecánica. Reacción al fuego: EUROCLASE A1. Sistema de galces desiguales: las placas encajan entre ellas dejando una entrecalle de 3 mm por donde se inserta la pasta de juntas. Este sistema no utiliza cinta de papel. La pasta de juntas se aplica en las cavidades de las placas y una masilla elástica en los encuentros. Atornillada a cada lado de una estructura metálica de acero galvanizado formada por canales de 50 mm y montantes de 51x49x49 mm con una modulación de 600 mm entre ejes, dando un ancho total de tabique de 109 mm. Incluida parte proporcional del resto de materiales: tornillería, pasta de juntas, masilla para encuentros perimetrales, fijaciones, junta estanca, etc. Montaje según norma de instalación UNE 102043 y exigencias del CTE.","Tabique formado por dos placas HIDRO de 15 mm de espesor compuestas por yeso natural, fibra de vidrio y aditivos inorgánicos que le aportan alta dureza y resistencia mecánica. Incorpora tratamiento hidrófugo, disminuyendo así su capacidad de absorción de agua (menor al 5%). Idónea para proteger las estancias de los efectos adversos de la humedad. Reacción al fuego: EUROCLASE A1. Sistema de galces desiguales: las placas encajan entre ellas dejando una entrecalle de 3 mm por donde se inserta la pasta de juntas. Este sistema no utiliza cinta de papel. La pasta de juntas se aplica en las cavidades de las placas y una masilla elástica en los encuentros. Atornillada a cada lado de una estructura metálica de acero galvanizado formada por canales de 50 mm y montantes de 51x49x49 mm con una modulación de 600 mm entre ejes, dando un ancho total de tabique de 109 mm. Incluida parte proporcional del resto de materiales: tornillería, pasta de juntas, masilla para encuentros perimetrales, fijaciones, junta estanca, etc. Montaje según norma de instalación UNE 102043 y exigencias del CTE.","Tabique formado por dos placas FUEGO de 15 mm de espesor compuestas por yeso natural, fibra de vidrio y aditivos inorgánicos que le aportan alta dureza y resistencia mecánica. Incorpora perlita y un aumento en la densidad que la hace idónea para un excelente comportamiento y resistencia frente al fuego. Reacción al fuego: EUROCLASE A1. Sistema de galces desiguales: las placas encajan entre ellas dejando una entrecalle de 3 mm por donde se inserta la pasta de juntas. Este sistema no utiliza cinta de papel. La pasta de juntas se aplica en las cavidades de las placas y una masilla elástica en los encuentros. Atornillada a cada lado de una estructura metálica de acero galvanizado formada por canales de 50 mm y montantes de 51x49x49 mm con una modulación de 600 mm entre ejes, dando un ancho total de tabique de 109 mm. Incluida parte proporcional del resto de materiales: tornillería, pasta de juntas, masilla para encuentros perimetrales, fijaciones, junta estanca, etc. Montaje según norma de instalación UNE 102043 y exigencias del CTE.","Tabique formado por dos placas RESIST de 15 mm de espesor compuestas por yeso natural, fibra de vidrio y aditivos inorgánicos que le aportan alta dureza y resistencia mecánica. Con mayor cantidad de fibra de vidrio y dosificación modificada, aumenta su densidad, mejorando notablemente la resistencia mecánica. Idónea para lugares con altas exigencias en cuanto a deterioro y desgaste. Reacción al fuego: EUROCLASE A1. Sistema de galces desiguales: las placas encajan entre ellas dejando una entrecalle de 3 mm por donde se inserta la pasta de juntas. Este sistema no utiliza cinta de papel. La pasta de juntas se aplica en las cavidades de las placas y una masilla elástica en los encuentros. Atornillada a cada lado de una estructura metálica de acero galvanizado formada por canales de 50 mm y montantes de 51x49x49 mm con una modulación de 600 mm entre ejes, dando un ancho total de tabique de 109 mm. Incluida parte proporcional del resto de materiales: tornillería, pasta de juntas, masilla para encuentros perimetrales, fijaciones, junta estanca, etc. Montaje según norma de instalación UNE 102043 y exigencias del CTE.","Tabique formado por dos placas HIDROPLUS de 15 mm de espesor compuestas por yeso natural, fibra de vidrio y aditivos inorgánicos que le aportan alta dureza y resistencia mecánica. Incorpora tratamiento hidrófugo y un aumento en su densidad, características claves para una elevada resistencia a la humedad (absorción de agua menor al 3%) y una gran resistencia mecánica. Idónea para zonas de intemperie. Reacción al fuego: EUROCLASE A1. Sistema de galces desiguales: las placas encajan entre ellas dejando una entrecalle de 3 mm por donde se inserta la pasta de juntas. Este sistema no utiliza cinta de papel. La pasta de juntas se aplica en las cavidades de las placas y una masilla elástica en los encuentros. Atornillada a cada lado de una estructura metálica de acero galvanizado formada por canales de 50 mm y montantes de 51x49x49 mm con una modulación de 600 mm entre ejes, dando un ancho total de tabique de 109 mm. Incluida parte proporcional del resto de materiales: tornillería, pasta de juntas, masilla para encuentros perimetrales, fijaciones, junta estanca, etc. Montaje según norma de instalación UNE 102043 y exigencias del CTE.","Tabique formado por dos placas SUPREM de 15 mm de espesor compuestas por yeso natural, fibra de vidrio y aditivos inorgánicos que le aportan alta dureza y resistencia mecánica. Incorpora tratamiento hidrófugo, perlita y un aumento en la densidad para conseguir soluciones constructivas que cumplan, altos requisitos frente al fuego y una capacidad reducida de absorción de agua. Reacción al fuego: EUROCLASE A1. Sistema de galces desiguales: las placas encajan entre ellas dejando una entrecalle de 3 mm por donde se inserta la pasta de juntas. Este sistema no utiliza cinta de papel. La pasta de juntas se aplica en las cavidades de las placas y una masilla elástica en los encuentros. Atornillada a cada lado de una estructura metálica de acero galvanizado formada por canales de 50 mm y montantes de 51x49x49 mm con una modulación de 600 mm entre ejes, dando un ancho total de tabique de 109 mm. Incluida parte proporcional del resto de materiales: tornillería, pasta de juntas, masilla para encuentros perimetrales, fijaciones, junta estanca, etc. Montaje según norma de instalación UNE 102043 y exigencias del CTE."]
[null,null,64980,"1.2.3","TABIQUE ATT® 129/600 (49)  [20+20+49+20+20]",600,49,40,"Tabique formado por dos placas BASIC de 20 mm de espesor compuestas por yeso natural, fibra de vidrio y aditivos inorgánicos que le aportan alta dureza y resistencia mecánica. Reacción al fuego: EUROCLASE A1. Sistema de galces desiguales: las placas encajan entre ellas dejando una entrecalle de 3 mm por donde se inserta la pasta de juntas. Este sistema no utiliza cinta de papel. La pasta de juntas se aplica en las cavidades de las placas y una masilla elástica en los encuentros. Atornillada a cada lado de una estructura metálica de acero galvanizado formada por canales de 50 mm y montantes de 51x49x49 mm con una modulación de 600 mm entre ejes, dando un ancho total de tabique de 129 mm. Incluida parte proporcional del resto de materiales: tornillería, pasta de juntas, masilla para encuentros perimetrales, fijaciones, junta estanca, etc. Montaje según norma de instalación UNE 102043 y exigencias del CTE.","Tabique formado por dos placas HIDRO de 20 mm de espesor compuestas por yeso natural, fibra de vidrio y aditivos inorgánicos que le aportan alta dureza y resistencia mecánica. Incorpora tratamiento hidrófugo, disminuyendo así su capacidad de absorción de agua (menor al 5%). Idónea para proteger las estancias de los efectos adversos de la humedad. Reacción al fuego: EUROCLASE A1. Sistema de galces desiguales: las placas encajan entre ellas dejando una entrecalle de 3 mm por donde se inserta la pasta de juntas. Este sistema no utiliza cinta de papel. La pasta de juntas se aplica en las cavidades de las placas y una masilla elástica en los encuentros. Atornillada a cada lado de una estructura metálica de acero galvanizado formada por canales de 50 mm y montantes de 51x49x49 mm con una modulación de 600 mm entre ejes, dando un ancho total de tabique de 129 mm. Incluida parte proporcional del resto de materiales: tornillería, pasta de juntas, masilla para encuentros perimetrales, fijaciones, junta estanca, etc. Montaje según norma de instalación UNE 102043 y exigencias del CTE.","Tabique formado por dos placas FUEGO de 20 mm de espesor compuestas por yeso natural, fibra de vidrio y aditivos inorgánicos que le aportan alta dureza y resistencia mecánica. Incorpora perlita y un aumento en la densidad que la hace idónea para un excelente comportamiento y resistencia frente al fuego. Reacción al fuego: EUROCLASE A1. Sistema de galces desiguales: las placas encajan entre ellas dejando una entrecalle de 3 mm por donde se inserta la pasta de juntas. Este sistema no utiliza cinta de papel. La pasta de juntas se aplica en las cavidades de las placas y una masilla elástica en los encuentros. Atornillada a cada lado de una estructura metálica de acero galvanizado formada por canales de 50 mm y montantes de 51x49x49 mm con una modulación de 600 mm entre ejes, dando un ancho total de tabique de 129 mm. Incluida parte proporcional del resto de materiales: tornillería, pasta de juntas, masilla para encuentros perimetrales, fijaciones, junta estanca, etc. Montaje según norma de instalación UNE 102043 y exigencias del CTE.","Tabique formado por dos placas RESIST de 20 mm de espesor compuestas por yeso natural, fibra de vidrio y aditivos inorgánicos que le aportan alta dureza y resistencia mecánica. Con mayor cantidad de fibra de vidrio y dosificación modificada, aumenta su densidad, mejorando notablemente la resistencia mecánica. Idónea para lugares con altas exigencias en cuanto a deterioro y desgaste. Reacción al fuego: EUROCLASE A1. Sistema de galces desiguales: las placas encajan entre ellas dejando una entrecalle de 3 mm por donde se inserta la pasta de juntas. Este sistema no utiliza cinta de papel. La pasta de juntas se aplica en las cavidades de las placas y una masilla elástica en los encuentros. Atornillada a cada lado de una estructura metálica de acero galvanizado formada por canales de 50 mm y montantes de 51x49x49 mm con una modulación de 600 mm entre ejes, dando un ancho total de tabique de 129 mm. Incluida parte proporcional del resto de materiales: tornillería, pasta de juntas, masilla para encuentros perimetrales, fijaciones, junta estanca, etc. Montaje según norma de instalación UNE 102043 y exigencias del CTE.","Tabique formado por dos placas HIDROPLUS de 20 mm de espesor compuestas por yeso natural, fibra de vidrio y aditivos inorgánicos que le aportan alta dureza y resistencia mecánica. Incorpora tratamiento hidrófugo y un aumento en su densidad, características claves para una elevada resistencia a la humedad (absorción de agua menor al 3%) y una gran resistencia mecánica. Idónea para zonas de intemperie. Reacción al fuego: EUROCLASE A1. Sistema de galces desiguales: las placas encajan entre ellas dejando una entrecalle de 3 mm por donde se inserta la pasta de juntas. Este sistema no utiliza cinta de papel. La pasta de juntas se aplica en las cavidades de las placas y una masilla elástica en los encuentros. Atornillada a cada lado de una estructura metálica de acero galvanizado formada por canales de 50 mm y montantes de 51x49x49 mm con una modulación de 600 mm entre ejes, dando un ancho total de tabique de 129 mm. Incluida parte proporcional del resto de materiales: tornillería, pasta de juntas, masilla para encuentros perimetrales, fijaciones, junta estanca, etc. Montaje según norma de instalación UNE 102043 y exigencias del CTE.","Tabique formado por dos placas SUPREM de 20 mm de espesor compuestas por yeso natural, fibra de vidrio y aditivos inorgánicos que le aportan alta dureza y resistencia mecánica. Incorpora tratamiento hidrófugo, perlita y un aumento en la densidad para conseguir soluciones constructivas que cumplan, altos requisitos frente al fuego y una capacidad reducida de absorción de agua. Reacción al fuego: EUROCLASE A1. Sistema de galces desiguales: las placas encajan entre ellas dejando una entrecalle de 3 mm por donde se inserta la pasta de juntas. Este sistema no utiliza cinta de papel. La pasta de juntas se aplica en las cavidades de las placas y una masilla elástica en los encuentros. Atornillada a cada lado de una estructura metálica de acero galvanizado formada por canales de 50 mm y montantes de 51x49x49 mm con una modulación de 600 mm entre ejes, dando un ancho total de tabique de 129 mm. Incluida parte proporcional del resto de materiales: tornillería, pasta de juntas, masilla para encuentros perimetrales, fijaciones, junta estanca, etc. Montaje según norma de instalación UNE 102043 y exigencias del CTE."]
["PLACA MIXTA",null,67452,"1.2.4","TABIQUE ATT® 126/600 (74)  [13+13+74+13+13]",600,74,26,"Tabique formado por dos placas BASIC de 13 mm de espesor compuestas por yeso natural, fibra de vidrio y aditivos inorgánicos que le aportan alta dureza y resistencia mecánica. Reacción al fuego: EUROCLASE A1. Sistema de galces desiguales: las placas encajan entre ellas dejando una entrecalle de 3 mm por donde se inserta la pasta de juntas. Este sistema no utiliza cinta de papel. La pasta de juntas se aplica en las cavidades de las placas y una masilla elástica en los encuentros. Atornillada a cada lado de una estructura metálica de acero galvanizado formada por canales de 75 mm y montantes de 51x74x49 mm con una modulación de 600 mm entre ejes, dando un ancho total de tabique de 126 mm. Incluida parte proporcional del resto de materiales: tornillería, pasta de juntas, masilla para encuentros perimetrales, fijaciones, junta estanca, etc. Montaje según norma de instalación UNE 102043 y exigencias del CTE.","Tabique formado por dos placas HIDRO de 13 mm de espesor compuestas por yeso natural, fibra de vidrio y aditivos inorgánicos que le aportan alta dureza y resistencia mecánica. Incorpora tratamiento hidrófugo, disminuyendo así su capacidad de absorción de agua (menor al 5%). Idónea para proteger las estancias de los efectos adversos de la humedad. Reacción al fuego: EUROCLASE A1. Sistema de galces desiguales: las placas encajan entre ellas dejando una entrecalle de 3 mm por donde se inserta la pasta de juntas. Este sistema no utiliza cinta de papel. La pasta de juntas se aplica en las cavidades de las placas y una masilla elástica en los encuentros. Atornillada a cada lado de una estructura metálica de acero galvanizado formada por canales de 75 mm y montantes de 51x74x49 mm con una modulación de 600 mm entre ejes, dando un ancho total de tabique de 126 mm. Incluida parte proporcional del resto de materiales: tornillería, pasta de juntas, masilla para encuentros perimetrales, fijaciones, junta estanca, etc. Montaje según norma de instalación UNE 102043 y exigencias del CTE.","Tabique formado por dos placas FUEGO de 13 mm de espesor compuestas por yeso natural, fibra de vidrio y aditivos inorgánicos que le aportan alta dureza y resistencia mecánica. Incorpora perlita y un aumento en la densidad que la hace idónea para un excelente comportamiento y resistencia frente al fuego. Reacción al fuego: EUROCLASE A1. Sistema de galces desiguales: las placas encajan entre ellas dejando una entrecalle de 3 mm por donde se inserta la pasta de juntas. Este sistema no utiliza cinta de papel. La pasta de juntas se aplica en las cavidades de las placas y una masilla elástica en los encuentros. Atornillada a cada lado de una estructura metálica de acero galvanizado formada por canales de 75 mm y montantes de 51x74x49 mm con una modulación de 600 mm entre ejes, dando un ancho total de tabique de 126 mm. Incluida parte proporcional del resto de materiales: tornillería, pasta de juntas, masilla para encuentros perimetrales, fijaciones, junta estanca, etc. Montaje según norma de instalación UNE 102043 y exigencias del CTE.","Tabique formado por dos placas RESIST de 13 mm de espesor compuestas por yeso natural, fibra de vidrio y aditivos inorgánicos que le aportan alta dureza y resistencia mecánica. Con mayor cantidad de fibra de vidrio y dosificación modificada, aumenta su densidad, mejorando notablemente la resistencia mecánica. Idónea para lugares con altas exigencias en cuanto a deterioro y desgaste. Reacción al fuego: EUROCLASE A1. Sistema de galces desiguales: las placas encajan entre ellas dejando una entrecalle de 3 mm por donde se inserta la pasta de juntas. Este sistema no utiliza cinta de papel. La pasta de juntas se aplica en las cavidades de las placas y una masilla elástica en los encuentros. Atornillada a cada lado de una estructura metálica de acero galvanizado formada por canales de 75 mm y montantes de 51x74x49 mm con una modulación de 600 mm entre ejes, dando un ancho total de tabique de 126 mm. Incluida parte proporcional del resto de materiales: tornillería, pasta de juntas, masilla para encuentros perimetrales, fijaciones, junta estanca, etc. Montaje según norma de instalación UNE 102043 y exigencias del CTE.","Tabique formado por dos placas HIDROPLUS de 13 mm de espesor compuestas por yeso natural, fibra de vidrio y aditivos inorgánicos que le aportan alta dureza y resistencia mecánica. Incorpora tratamiento hidrófugo y un aumento en su densidad, características claves para una elevada resistencia a la humedad (absorción de agua menor al 3%) y una gran resistencia mecánica. Idónea para zonas de intemperie. Reacción al fuego: EUROCLASE A1. Sistema de galces desiguales: las placas encajan entre ellas dejando una entrecalle de 3 mm por donde se inserta la pasta de juntas. Este sistema no utiliza cinta de papel. La pasta de juntas se aplica en las cavidades de las placas y una masilla elástica en los encuentros. Atornillada a cada lado de una estructura metálica de acero galvanizado formada por canales de 75 mm y montantes de 51x74x49 mm con una modulación de 600 mm entre ejes, dando un ancho total de tabique de 126 mm. Incluida parte proporcional del resto de materiales: tornillería, pasta de juntas, masilla para encuentros perimetrales, fijaciones, junta estanca, etc. Montaje según norma de instalación UNE 102043 y exigencias del CTE.","Tabique formado por dos placas SUPREM de 13 mm de espesor compuestas por yeso natural, fibra de vidrio y aditivos inorgánicos que le aportan alta dureza y resistencia mecánica. Incorpora tratamiento hidrófugo, perlita y un aumento en la densidad para conseguir soluciones constructivas que cumplan, altos requisitos frente al fuego y una capacidad reducida de absorción de agua. Reacción al fuego: EUROCLASE A1. Sistema de galces desiguales: las placas encajan entre ellas dejando una entrecalle de 3 mm por donde se inserta la pasta de juntas. Este sistema no utiliza cinta de papel. La pasta de juntas se aplica en las cavidades de las placas y una masilla elástica en los encuentros. Atornillada a cada lado de una estructura metálica de acero galvanizado formada por canales de 75 mm y montantes de 51x74x49 mm con una modulación de 600 mm entre ejes, dando un ancho total de tabique de 126 mm. Incluida parte proporcional del resto de materiales: tornillería, pasta de juntas, masilla para encuentros perimetrales, fijaciones, junta estanca, etc. Montaje según norma de instalación UNE 102043 y exigencias del CTE."]
[null,null,67460,"1.2.5","TABIQUE ATT® 134/600 (74)  [15+15+74+15+15]",600,74,30,"Tabique formado por dos placas BASIC de 15 mm de espesor compuestas por yeso natural, fibra de vidrio y aditivos inorgánicos que le aportan alta dureza y resistencia mecánica. Reacción al fuego: EUROCLASE A1. Sistema de galces desiguales: las placas encajan entre ellas dejando una entrecalle de 3 mm por donde se inserta la pasta de juntas. Este sistema no utiliza cinta de papel. La pasta de juntas se aplica en las cavidades de las placas y una masilla elástica en los encuentros. Atornillada a cada lado de una estructura metálica de acero galvanizado formada por canales de 75 mm y montantes de 51x74x49 mm con una modulación de 600 mm entre ejes, dando un ancho total de tabique de 134 mm. Incluida parte proporcional del resto de materiales: tornillería, pasta de juntas, masilla para encuentros perimetrales, fijaciones, junta estanca, etc. Montaje según norma de instalación UNE 102043 y exigencias del CTE.","Tabique formado por dos placas HIDRO de 15 mm de espesor compuestas por yeso natural, fibra de vidrio y aditivos inorgánicos que le aportan alta dureza y resistencia mecánica. Incorpora tratamiento hidrófugo, disminuyendo así su capacidad de absorción de agua (menor al 5%). Idónea para proteger las estancias de los efectos adversos de la humedad. Reacción al fuego: EUROCLASE A1. Sistema de galces desiguales: las placas encajan entre ellas dejando una entrecalle de 3 mm por donde se inserta la pasta de juntas. Este sistema no utiliza cinta de papel. La pasta de juntas se aplica en las cavidades de las placas y una masilla elástica en los encuentros. Atornillada a cada lado de una estructura metálica de acero galvanizado formada por canales de 75 mm y montantes de 51x74x49 mm con una modulación de 600 mm entre ejes, dando un ancho total de tabique de 134 mm. Incluida parte proporcional del resto de materiales: tornillería, pasta de juntas, masilla para encuentros perimetrales, fijaciones, junta estanca, etc. Montaje según norma de instalación UNE 102043 y exigencias del CTE.","Tabique formado por dos placas FUEGO de 15 mm de espesor compuestas por yeso natural, fibra de vidrio y aditivos inorgánicos que le aportan alta dureza y resistencia mecánica. Incorpora perlita y un aumento en la densidad que la hace idónea para un excelente comportamiento y resistencia frente al fuego. Reacción al fuego: EUROCLASE A1. Sistema de galces desiguales: las placas encajan entre ellas dejando una entrecalle de 3 mm por donde se inserta la pasta de juntas. Este sistema no utiliza cinta de papel. La pasta de juntas se aplica en las cavidades de las placas y una masilla elástica en los encuentros. Atornillada a cada lado de una estructura metálica de acero galvanizado formada por canales de 75 mm y montantes de 51x74x49 mm con una modulación de 600 mm entre ejes, dando un ancho total de tabique de 134 mm. Incluida parte proporcional del resto de materiales: tornillería, pasta de juntas, masilla para encuentros perimetrales, fijaciones, junta estanca, etc. Montaje según norma de instalación UNE 102043 y exigencias del CTE.","Tabique formado por dos placas RESIST de 15 mm de espesor compuestas por yeso natural, fibra de vidrio y aditivos inorgánicos que le aportan alta dureza y resistencia mecánica. Con mayor cantidad de fibra de vidrio y dosificación modificada, aumenta su densidad, mejorando notablemente la resistencia mecánica. Idónea para lugares con altas exigencias en cuanto a deterioro y desgaste. Reacción al fuego: EUROCLASE A1. Sistema de galces desiguales: las placas encajan entre ellas dejando una entrecalle de 3 mm por donde se inserta la pasta de juntas. Este sistema no utiliza cinta de papel. La pasta de juntas se aplica en las cavidades de las placas y una masilla elástica en los encuentros. Atornillada a cada lado de una estructura metálica de acero galvanizado formada por canales de 75 mm y montantes de 51x74x49 mm con una modulación de 600 mm entre ejes, dando un ancho total de tabique de 134 mm. Incluida parte proporcional del resto de materiales: tornillería, pasta de juntas, masilla para encuentros perimetrales, fijaciones, junta estanca, etc. Montaje según norma de instalación UNE 102043 y exigencias del CTE.","Tabique formado por dos placas HIDROPLUS de 15 mm de espesor compuestas por yeso natural, fibra de vidrio y aditivos inorgánicos que le aportan alta dureza y resistencia mecánica. Incorpora tratamiento hidrófugo y un aumento en su densidad, características claves para una elevada resistencia a la humedad (absorción de agua menor al 3%) y una gran resistencia mecánica. Idónea para zonas de intemperie. Reacción al fuego: EUROCLASE A1. Sistema de galces desiguales: las placas encajan entre ellas dejando una entrecalle de 3 mm por donde se inserta la pasta de juntas. Este sistema no utiliza cinta de papel. La pasta de juntas se aplica en las cavidades de las placas y una masilla elástica en los encuentros. Atornillada a cada lado de una estructura metálica de acero galvanizado formada por canales de 75 mm y montantes de 51x74x49 mm con una modulación de 600 mm entre ejes, dando un ancho total de tabique de 134 mm. Incluida parte proporcional del resto de materiales: tornillería, pasta de juntas, masilla para encuentros perimetrales, fijaciones, junta estanca, etc. Montaje según norma de instalación UNE 102043 y exigencias del CTE.","Tabique formado por dos placas SUPREM de 15 mm de espesor compuestas por yeso natural, fibra de vidrio y aditivos inorgánicos que le aportan alta dureza y resistencia mecánica. Incorpora tratamiento hidrófugo, perlita y un aumento en la densidad para conseguir soluciones constructivas que cumplan, altos requisitos frente al fuego y una capacidad reducida de absorción de agua. Reacción al fuego: EUROCLASE A1. Sistema de galces desiguales: las placas encajan entre ellas dejando una entrecalle de 3 mm por donde se inserta la pasta de juntas. Este sistema no utiliza cinta de papel. La pasta de juntas se aplica en las cavidades de las placas y una masilla elástica en los encuentros. Atornillada a cada lado de una estructura metálica de acero galvanizado formada por canales de 75 mm y montantes de 51x74x49 mm con una modulación de 600 mm entre ejes, dando un ancho total de tabique de 134 mm. Incluida parte proporcional del resto de materiales: tornillería, pasta de juntas, masilla para encuentros perimetrales, fijaciones, junta estanca, etc. Montaje según norma de instalación UNE 102043 y exigencias del CTE."]
[null,null,67480,"1.2.6","TABIQUE ATT® 154/600 (74)  [20+20+74+20+20]",600,74,40,"Tabique formado por dos placas BASIC de 20 mm de espesor compuestas por yeso natural, fibra de vidrio y aditivos inorgánicos que le aportan alta dureza y resistencia mecánica. Reacción al fuego: EUROCLASE A1. Sistema de galces desiguales: las placas encajan entre ellas dejando una entrecalle de 3 mm por donde se inserta la pasta de juntas. Este sistema no utiliza cinta de papel. La pasta de juntas se aplica en las cavidades de las placas y una masilla elástica en los encuentros. Atornillada a cada lado de una estructura metálica de acero galvanizado formada por canales de 75 mm y montantes de 51x74x49 mm con una modulación de 600 mm entre ejes, dando un ancho total de tabique de 154 mm. Incluida parte proporcional del resto de materiales: tornillería, pasta de juntas, masilla para encuentros perimetrales, fijaciones, junta estanca, etc. Montaje según norma de instalación UNE 102043 y exigencias del CTE.","Tabique formado por dos placas HIDRO de 20 mm de espesor compuestas por yeso natural, fibra de vidrio y aditivos inorgánicos que le aportan alta dureza y resistencia mecánica. Incorpora tratamiento hidrófugo, disminuyendo así su capacidad de absorción de agua (menor al 5%). Idónea para proteger las estancias de los efectos adversos de la humedad. Reacción al fuego: EUROCLASE A1. Sistema de galces desiguales: las placas encajan entre ellas dejando una entrecalle de 3 mm por donde se inserta la pasta de juntas. Este sistema no utiliza cinta de papel. La pasta de juntas se aplica en las cavidades de las placas y una masilla elástica en los encuentros. Atornillada a cada lado de una estructura metálica de acero galvanizado formada por canales de 75 mm y montantes de 51x74x49 mm con una modulación de 600 mm entre ejes, dando un ancho total de tabique de 154 mm. Incluida parte proporcional del resto de materiales: tornillería, pasta de juntas, masilla para encuentros perimetrales, fijaciones, junta estanca, etc. Montaje según norma de instalación UNE 102043 y exigencias del CTE.","Tabique formado por dos placas FUEGO de 20 mm de espesor compuestas por yeso natural, fibra de vidrio y aditivos inorgánicos que le aportan alta dureza y resistencia mecánica. Incorpora perlita y un aumento en la densidad que la hace idónea para un excelente comportamiento y resistencia frente al fuego. Reacción al fuego: EUROCLASE A1. Sistema de galces desiguales: las placas encajan entre ellas dejando una entrecalle de 3 mm por donde se inserta la pasta de juntas. Este sistema no utiliza cinta de papel. La pasta de juntas se aplica en las cavidades de las placas y una masilla elástica en los encuentros. Atornillada a cada lado de una estructura metálica de acero galvanizado formada por canales de 75 mm y montantes de 51x74x49 mm con una modulación de 600 mm entre ejes, dando un ancho total de tabique de 154 mm. Incluida parte proporcional del resto de materiales: tornillería, pasta de juntas, masilla para encuentros perimetrales, fijaciones, junta estanca, etc. Montaje según norma de instalación UNE 102043 y exigencias del CTE.","Tabique formado por dos placas RESIST de 20 mm de espesor compuestas por yeso natural, fibra de vidrio y aditivos inorgánicos que le aportan alta dureza y resistencia mecánica. Con mayor cantidad de fibra de vidrio y dosificación modificada, aumenta su densidad, mejorando notablemente la resistencia mecánica. Idónea para lugares con altas exigencias en cuanto a deterioro y desgaste. Reacción al fuego: EUROCLASE A1. Sistema de galces desiguales: las placas encajan entre ellas dejando una entrecalle de 3 mm por donde se inserta la pasta de juntas. Este sistema no utiliza cinta de papel. La pasta de juntas se aplica en las cavidades de las placas y una masilla elástica en los encuentros. Atornillada a cada lado de una estructura metálica de acero galvanizado formada por canales de 75 mm y montantes de 51x74x49 mm con una modulación de 600 mm entre ejes, dando un ancho total de tabique de 154 mm. Incluida parte proporcional del resto de materiales: tornillería, pasta de juntas, masilla para encuentros perimetrales, fijaciones, junta estanca, etc. Montaje según norma de instalación UNE 102043 y exigencias del CTE.","Tabique formado por dos placas HIDROPLUS de 20 mm de espesor compuestas por yeso natural, fibra de vidrio y aditivos inorgánicos que le aportan alta dureza y resistencia mecánica. Incorpora tratamiento hidrófugo y un aumento en su densidad, características claves para una elevada resistencia a la humedad (absorción de agua menor al 3%) y una gran resistencia mecánica. Idónea para zonas de intemperie. Reacción al fuego: EUROCLASE A1. Sistema de galces desiguales: las placas encajan entre ellas dejando una entrecalle de 3 mm por donde se inserta la pasta de juntas. Este sistema no utiliza cinta de papel. La pasta de juntas se aplica en las cavidades de las placas y una masilla elástica en los encuentros. Atornillada a cada lado de una estructura metálica de acero galvanizado formada por canales de 75 mm y montantes de 51x74x49 mm con una modulación de 600 mm entre ejes, dando un ancho total de tabique de 154 mm. Incluida parte proporcional del resto de materiales: tornillería, pasta de juntas, masilla para encuentros perimetrales, fijaciones, junta estanca, etc. Montaje según norma de instalación UNE 102043 y exigencias del CTE.","Tabique formado por dos placas SUPREM de 20 mm de espesor compuestas por yeso natural, fibra de vidrio y aditivos inorgánicos que le aportan alta dureza y resistencia mecánica. Incorpora tratamiento hidrófugo, perlita y un aumento en la densidad para conseguir soluciones constructivas que cumplan, altos requisitos frente al fuego y una capacidad reducida de absorción de agua. Reacción al fuego: EUROCLASE A1. Sistema de galces desiguales: las placas encajan entre ellas dejando una entrecalle de 3 mm por donde se inserta la pasta de juntas. Este sistema no utiliza cinta de papel. La pasta de juntas se aplica en las cavidades de las placas y una masilla elástica en los encuentros. Atornillada a cada lado de una estructura metálica de acero galvanizado formada por canales de 75 mm y montantes de 51x74x49 mm con una modulación de 600 mm entre ejes, dando un ancho total de tabique de 154 mm. Incluida parte proporcional del resto de materiales: tornillería, pasta de juntas, masilla para encuentros perimetrales, fijaciones, junta estanca, etc. Montaje según norma de instalación UNE 102043 y exigencias del CTE."]
[null,null,69952,"1.2.7","TABIQUE ATT® 151/600 (99)  [13+13+99+13+13]",600,99,26,"Tabique formado por dos placas BASIC de 13 mm de espesor compuestas por yeso natural, fibra de vidrio y aditivos inorgánicos que le aportan alta dureza y resistencia mecánica. Reacción al fuego: EUROCLASE A1. Sistema de galces desiguales: las placas encajan entre ellas dejando una entrecalle de 3 mm por donde se inserta la pasta de juntas. Este sistema no utiliza cinta de papel. La pasta de juntas se aplica en las cavidades de las placas y una masilla elástica en los encuentros. Atornillada a cada lado de una estructura metálica de acero galvanizado formada por canales de 100 mm y montantes de 51x99x49 mm con una modulación de 600 mm entre ejes, dando un ancho total de tabique de 151 mm. Incluida parte proporcional del resto de materiales: tornillería, pasta de juntas, masilla para encuentros perimetrales, fijaciones, junta estanca, etc. Montaje según norma de instalación UNE 102043 y exigencias del CTE.","Tabique formado por dos placas HIDRO de 13 mm de espesor compuestas por yeso natural, fibra de vidrio y aditivos inorgánicos que le aportan alta dureza y resistencia mecánica. Incorpora tratamiento hidrófugo, disminuyendo así su capacidad de absorción de agua (menor al 5%). Idónea para proteger las estancias de los efectos adversos de la humedad. Reacción al fuego: EUROCLASE A1. Sistema de galces desiguales: las placas encajan entre ellas dejando una entrecalle de 3 mm por donde se inserta la pasta de juntas. Este sistema no utiliza cinta de papel. La pasta de juntas se aplica en las cavidades de las placas y una masilla elástica en los encuentros. Atornillada a cada lado de una estructura metálica de acero galvanizado formada por canales de 100 mm y montantes de 51x99x49 mm con una modulación de 600 mm entre ejes, dando un ancho total de tabique de 151 mm. Incluida parte proporcional del resto de materiales: tornillería, pasta de juntas, masilla para encuentros perimetrales, fijaciones, junta estanca, etc. Montaje según norma de instalación UNE 102043 y exigencias del CTE.","Tabique formado por dos placas FUEGO de 13 mm de espesor compuestas por yeso natural, fibra de vidrio y aditivos inorgánicos que le aportan alta dureza y resistencia mecánica. Incorpora perlita y un aumento en la densidad que la hace idónea para un excelente comportamiento y resistencia frente al fuego. Reacción al fuego: EUROCLASE A1. Sistema de galces desiguales: las placas encajan entre ellas dejando una entrecalle de 3 mm por donde se inserta la pasta de juntas. Este sistema no utiliza cinta de papel. La pasta de juntas se aplica en las cavidades de las placas y una masilla elástica en los encuentros. Atornillada a cada lado de una estructura metálica de acero galvanizado formada por canales de 100 mm y montantes de 51x99x49 mm con una modulación de 600 mm entre ejes, dando un ancho total de tabique de 151 mm. Incluida parte proporcional del resto de materiales: tornillería, pasta de juntas, masilla para encuentros perimetrales, fijaciones, junta estanca, etc. Montaje según norma de instalación UNE 102043 y exigencias del CTE.","Tabique formado por dos placas RESIST de 13 mm de espesor compuestas por yeso natural, fibra de vidrio y aditivos inorgánicos que le aportan alta dureza y resistencia mecánica. Con mayor cantidad de fibra de vidrio y dosificación modificada, aumenta su densidad, mejorando notablemente la resistencia mecánica. Idónea para lugares con altas exigencias en cuanto a deterioro y desgaste. Reacción al fuego: EUROCLASE A1. Sistema de galces desiguales: las placas encajan entre ellas dejando una entrecalle de 3 mm por donde se inserta la pasta de juntas. Este sistema no utiliza cinta de papel. La pasta de juntas se aplica en las cavidades de las placas y una masilla elástica en los encuentros. Atornillada a cada lado de una estructura metálica de acero galvanizado formada por canales de 100 mm y montantes de 51x99x49 mm con una modulación de 600 mm entre ejes, dando un ancho total de tabique de 151 mm. Incluida parte proporcional del resto de materiales: tornillería, pasta de juntas, masilla para encuentros perimetrales, fijaciones, junta estanca, etc. Montaje según norma de instalación UNE 102043 y exigencias del CTE.","Tabique formado por dos placas HIDROPLUS de 13 mm de espesor compuestas por yeso natural, fibra de vidrio y aditivos inorgánicos que le aportan alta dureza y resistencia mecánica. Incorpora tratamiento hidrófugo y un aumento en su densidad, características claves para una elevada resistencia a la humedad (absorción de agua menor al 3%) y una gran resistencia mecánica. Idónea para zonas de intemperie. Reacción al fuego: EUROCLASE A1. Sistema de galces desiguales: las placas encajan entre ellas dejando una entrecalle de 3 mm por donde se inserta la pasta de juntas. Este sistema no utiliza cinta de papel. La pasta de juntas se aplica en las cavidades de las placas y una masilla elástica en los encuentros. Atornillada a cada lado de una estructura metálica de acero galvanizado formada por canales de 100 mm y montantes de 51x99x49 mm con una modulación de 600 mm entre ejes, dando un ancho total de tabique de 151 mm. Incluida parte proporcional del resto de materiales: tornillería, pasta de juntas, masilla para encuentros perimetrales, fijaciones, junta estanca, etc. Montaje según norma de instalación UNE 102043 y exigencias del CTE.","Tabique formado por dos placas SUPREM de 13 mm de espesor compuestas por yeso natural, fibra de vidrio y aditivos inorgánicos que le aportan alta dureza y resistencia mecánica. Incorpora tratamiento hidrófugo, perlita y un aumento en la densidad para conseguir soluciones constructivas que cumplan, altos requisitos frente al fuego y una capacidad reducida de absorción de agua. Reacción al fuego: EUROCLASE A1. Sistema de galces desiguales: las placas encajan entre ellas dejando una entrecalle de 3 mm por donde se inserta la pasta de juntas. Este sistema no utiliza cinta de papel. La pasta de juntas se aplica en las cavidades de las placas y una masilla elástica en los encuentros. Atornillada a cada lado de una estructura metálica de acero galvanizado formada por canales de 100 mm y montantes de 51x99x49 mm con una modulación de 600 mm entre ejes, dando un ancho total de tabique de 151 mm. Incluida parte proporcional del resto de materiales: tornillería, pasta de juntas, masilla para encuentros perimetrales, fijaciones, junta estanca, etc. Montaje según norma de instalación UNE 102043 y exigencias del CTE."]
[null,null,69960,"1.2.8","TABIQUE ATT® 159/600 (99)  [15+15+99+15+15]",600,99,30,"Tabique formado por dos placas BASIC de 15 mm de espesor compuestas por yeso natural, fibra de vidrio y aditivos inorgánicos que le aportan alta dureza y resistencia mecánica. Reacción al fuego: EUROCLASE A1. Sistema de galces desiguales: las placas encajan entre ellas dejando una entrecalle de 3 mm por donde se inserta la pasta de juntas. Este sistema no utiliza cinta de papel. La pasta de juntas se aplica en las cavidades de las placas y una masilla elástica en los encuentros. Atornillada a cada lado de una estructura metálica de acero galvanizado formada por canales de 100 mm y montantes de 51x99x49 mm con una modulación de 600 mm entre ejes, dando un ancho total de tabique de 159 mm. Incluida parte proporcional del resto de materiales: tornillería, pasta de juntas, masilla para encuentros perimetrales, fijaciones, junta estanca, etc. Montaje según norma de instalación UNE 102043 y exigencias del CTE.","Tabique formado por dos placas HIDRO de 15 mm de espesor compuestas por yeso natural, fibra de vidrio y aditivos inorgánicos que le aportan alta dureza y resistencia mecánica. Incorpora tratamiento hidrófugo, disminuyendo así su capacidad de absorción de agua (menor al 5%). Idónea para proteger las estancias de los efectos adversos de la humedad. Reacción al fuego: EUROCLASE A1. Sistema de galces desiguales: las placas encajan entre ellas dejando una entrecalle de 3 mm por donde se inserta la pasta de juntas. Este sistema no utiliza cinta de papel. La pasta de juntas se aplica en las cavidades de las placas y una masilla elástica en los encuentros. Atornillada a cada lado de una estructura metálica de acero galvanizado formada por canales de 100 mm y montantes de 51x99x49 mm con una modulación de 600 mm entre ejes, dando un ancho total de tabique de 159 mm. Incluida parte proporcional del resto de materiales: tornillería, pasta de juntas, masilla para encuentros perimetrales, fijaciones, junta estanca, etc. Montaje según norma de instalación UNE 102043 y exigencias del CTE.","Tabique formado por dos placas FUEGO de 15 mm de espesor compuestas por yeso natural, fibra de vidrio y aditivos inorgánicos que le aportan alta dureza y resistencia mecánica. Incorpora perlita y un aumento en la densidad que la hace idónea para un excelente comportamiento y resistencia frente al fuego. Reacción al fuego: EUROCLASE A1. Sistema de galces desiguales: las placas encajan entre ellas dejando una entrecalle de 3 mm por donde se inserta la pasta de juntas. Este sistema no utiliza cinta de papel. La pasta de juntas se aplica en las cavidades de las placas y una masilla elástica en los encuentros. Atornillada a cada lado de una estructura metálica de acero galvanizado formada por canales de 100 mm y montantes de 51x99x49 mm con una modulación de 600 mm entre ejes, dando un ancho total de tabique de 159 mm. Incluida parte proporcional del resto de materiales: tornillería, pasta de juntas, masilla para encuentros perimetrales, fijaciones, junta estanca, etc. Montaje según norma de instalación UNE 102043 y exigencias del CTE.","Tabique formado por dos placas RESIST de 15 mm de espesor compuestas por yeso natural, fibra de vidrio y aditivos inorgánicos que le aportan alta dureza y resistencia mecánica. Con mayor cantidad de fibra de vidrio y dosificación modificada, aumenta su densidad, mejorando notablemente la resistencia mecánica. Idónea para lugares con altas exigencias en cuanto a deterioro y desgaste. Reacción al fuego: EUROCLASE A1. Sistema de galces desiguales: las placas encajan entre ellas dejando una entrecalle de 3 mm por donde se inserta la pasta de juntas. Este sistema no utiliza cinta de papel. La pasta de juntas se aplica en las cavidades de las placas y una masilla elástica en los encuentros. Atornillada a cada lado de una estructura metálica de acero galvanizado formada por canales de 100 mm y montantes de 51x99x49 mm con una modulación de 600 mm entre ejes, dando un ancho total de tabique de 159 mm. Incluida parte proporcional del resto de materiales: tornillería, pasta de juntas, masilla para encuentros perimetrales, fijaciones, junta estanca, etc. Montaje según norma de instalación UNE 102043 y exigencias del CTE.","Tabique formado por dos placas HIDROPLUS de 15 mm de espesor compuestas por yeso natural, fibra de vidrio y aditivos inorgánicos que le aportan alta dureza y resistencia mecánica. Incorpora tratamiento hidrófugo y un aumento en su densidad, características claves para una elevada resistencia a la humedad (absorción de agua menor al 3%) y una gran resistencia mecánica. Idónea para zonas de intemperie. Reacción al fuego: EUROCLASE A1. Sistema de galces desiguales: las placas encajan entre ellas dejando una entrecalle de 3 mm por donde se inserta la pasta de juntas. Este sistema no utiliza cinta de papel. La pasta de juntas se aplica en las cavidades de las placas y una masilla elástica en los encuentros. Atornillada a cada lado de una estructura metálica de acero galvanizado formada por canales de 100 mm y montantes de 51x99x49 mm con una modulación de 600 mm entre ejes, dando un ancho total de tabique de 159 mm. Incluida parte proporcional del resto de materiales: tornillería, pasta de juntas, masilla para encuentros perimetrales, fijaciones, junta estanca, etc. Montaje según norma de instalación UNE 102043 y exigencias del CTE.","Tabique formado por dos placas SUPREM de 15 mm de espesor compuestas por yeso natural, fibra de vidrio y aditivos inorgánicos que le aportan alta dureza y resistencia mecánica. Incorpora tratamiento hidrófugo, perlita y un aumento en la densidad para conseguir soluciones constructivas que cumplan, altos requisitos frente al fuego y una capacidad reducida de absorción de agua. Reacción al fuego: EUROCLASE A1. Sistema de galces desiguales: las placas encajan entre ellas dejando una entrecalle de 3 mm por donde se inserta la pasta de juntas. Este sistema no utiliza cinta de papel. La pasta de juntas se aplica en las cavidades de las placas y una masilla elástica en los encuentros. Atornillada a cada lado de una estructura metálica de acero galvanizado formada por canales de 100 mm y montantes de 51x99x49 mm con una modulación de 600 mm entre ejes, dando un ancho total de tabique de 159 mm. Incluida parte proporcional del resto de materiales: tornillería, pasta de juntas, masilla para encuentros perimetrales, fijaciones, junta estanca, etc. Montaje según norma de instalación UNE 102043 y exigencias del CTE."]
[null,null,69980,"1.2.9","TABIQUE ATT® 179/600 (99)  [20+20+99+20+20]",600,99,40,"Tabique formado por dos placas BASIC de 20 mm de espesor compuestas por yeso natural, fibra de vidrio y aditivos inorgánicos que le aportan alta dureza y resistencia mecánica. Reacción al fuego: EUROCLASE A1. Sistema de galces desiguales: las placas encajan entre ellas dejando una entrecalle de 3 mm por donde se inserta la pasta de juntas. Este sistema no utiliza cinta de papel. La pasta de juntas se aplica en las cavidades de las placas y una masilla elástica en los encuentros. Atornillada a cada lado de una estructura metálica de acero galvanizado formada por canales de 100 mm y montantes de 51x99x49 mm con una modulación de 600 mm entre ejes, dando un ancho total de tabique de 179 mm. Incluida parte proporcional del resto de materiales: tornillería, pasta de juntas, masilla para encuentros perimetrales, fijaciones, junta estanca, etc. Montaje según norma de instalación UNE 102043 y exigencias del CTE.","Tabique formado por dos placas HIDRO de 20 mm de espesor compuestas por yeso natural, fibra de vidrio y aditivos inorgánicos que le aportan alta dureza y resistencia mecánica. Incorpora tratamiento hidrófugo, disminuyendo así su capacidad de absorción de agua (menor al 5%). Idónea para proteger las estancias de los efectos adversos de la humedad. Reacción al fuego: EUROCLASE A1. Sistema de galces desiguales: las placas encajan entre ellas dejando una entrecalle de 3 mm por donde se inserta la pasta de juntas. Este sistema no utiliza cinta de papel. La pasta de juntas se aplica en las cavidades de las placas y una masilla elástica en los encuentros. Atornillada a cada lado de una estructura metálica de acero galvanizado formada por canales de 100 mm y montantes de 51x99x49 mm con una modulación de 600 mm entre ejes, dando un ancho total de tabique de 179 mm. Incluida parte proporcional del resto de materiales: tornillería, pasta de juntas, masilla para encuentros perimetrales, fijaciones, junta estanca, etc. Montaje según norma de instalación UNE 102043 y exigencias del CTE.","Tabique formado por dos placas FUEGO de 20 mm de espesor compuestas por yeso natural, fibra de vidrio y aditivos inorgánicos que le aportan alta dureza y resistencia mecánica. Incorpora perlita y un aumento en la densidad que la hace idónea para un excelente comportamiento y resistencia frente al fuego. Reacción al fuego: EUROCLASE A1. Sistema de galces desiguales: las placas encajan entre ellas dejando una entrecalle de 3 mm por donde se inserta la pasta de juntas. Este sistema no utiliza cinta de papel. La pasta de juntas se aplica en las cavidades de las placas y una masilla elástica en los encuentros. Atornillada a cada lado de una estructura metálica de acero galvanizado formada por canales de 100 mm y montantes de 51x99x49 mm con una modulación de 600 mm entre ejes, dando un ancho total de tabique de 179 mm. Incluida parte proporcional del resto de materiales: tornillería, pasta de juntas, masilla para encuentros perimetrales, fijaciones, junta estanca, etc. Montaje según norma de instalación UNE 102043 y exigencias del CTE.","Tabique formado por dos placas RESIST de 20 mm de espesor compuestas por yeso natural, fibra de vidrio y aditivos inorgánicos que le aportan alta dureza y resistencia mecánica. Con mayor cantidad de fibra de vidrio y dosificación modificada, aumenta su densidad, mejorando notablemente la resistencia mecánica. Idónea para lugares con altas exigencias en cuanto a deterioro y desgaste. Reacción al fuego: EUROCLASE A1. Sistema de galces desiguales: las placas encajan entre ellas dejando una entrecalle de 3 mm por donde se inserta la pasta de juntas. Este sistema no utiliza cinta de papel. La pasta de juntas se aplica en las cavidades de las placas y una masilla elástica en los encuentros. Atornillada a cada lado de una estructura metálica de acero galvanizado formada por canales de 100 mm y montantes de 51x99x49 mm con una modulación de 600 mm entre ejes, dando un ancho total de tabique de 179 mm. Incluida parte proporcional del resto de materiales: tornillería, pasta de juntas, masilla para encuentros perimetrales, fijaciones, junta estanca, etc. Montaje según norma de instalación UNE 102043 y exigencias del CTE.","Tabique formado por dos placas HIDROPLUS de 20 mm de espesor compuestas por yeso natural, fibra de vidrio y aditivos inorgánicos que le aportan alta dureza y resistencia mecánica. Incorpora tratamiento hidrófugo y un aumento en su densidad, características claves para una elevada resistencia a la humedad (absorción de agua menor al 3%) y una gran resistencia mecánica. Idónea para zonas de intemperie. Reacción al fuego: EUROCLASE A1. Sistema de galces desiguales: las placas encajan entre ellas dejando una entrecalle de 3 mm por donde se inserta la pasta de juntas. Este sistema no utiliza cinta de papel. La pasta de juntas se aplica en las cavidades de las placas y una masilla elástica en los encuentros. Atornillada a cada lado de una estructura metálica de acero galvanizado formada por canales de 100 mm y montantes de 51x99x49 mm con una modulación de 600 mm entre ejes, dando un ancho total de tabique de 179 mm. Incluida parte proporcional del resto de materiales: tornillería, pasta de juntas, masilla para encuentros perimetrales, fijaciones, junta estanca, etc. Montaje según norma de instalación UNE 102043 y exigencias del CTE.","Tabique formado por dos placas SUPREM de 20 mm de espesor compuestas por yeso natural, fibra de vidrio y aditivos inorgánicos que le aportan alta dureza y resistencia mecánica. Incorpora tratamiento hidrófugo, perlita y un aumento en la densidad para conseguir soluciones constructivas que cumplan, altos requisitos frente al fuego y una capacidad reducida de absorción de agua. Reacción al fuego: EUROCLASE A1. Sistema de galces desiguales: las placas encajan entre ellas dejando una entrecalle de 3 mm por donde se inserta la pasta de juntas. Este sistema no utiliza cinta de papel. La pasta de juntas se aplica en las cavidades de las placas y una masilla elástica en los encuentros. Atornillada a cada lado de una estructura metálica de acero galvanizado formada por canales de 100 mm y montantes de 51x99x49 mm con una modulación de 600 mm entre ejes, dando un ancho total de tabique de 179 mm. Incluida parte proporcional del resto de materiales: tornillería, pasta de juntas, masilla para encuentros perimetrales, fijaciones, junta estanca, etc. Montaje según norma de instalación UNE 102043 y exigencias del CTE."]
[null,null,44952,"1.2.10","TABIQUE ATT® 101/400 (49)  [13+13+49+13+13]",400,49,26,"Tabique formado por dos placas BASIC de 13 mm de espesor compuestas por yeso natural, fibra de vidrio y aditivos inorgánicos que le aportan alta dureza y resistencia mecánica. Reacción al fuego: EUROCLASE A1. Sistema de galces desiguales: las placas encajan entre ellas dejando una entrecalle de 3 mm por donde se inserta la pasta de juntas. Este sistema no utiliza cinta de papel. La pasta de juntas se aplica en las cavidades de las placas y una masilla elástica en los encuentros. Atornillada a cada lado de una estructura metálica de acero galvanizado formada por canales de 50 mm y montantes de 51x49x49 mm con una modulación de 400 mm entre ejes, dando un ancho total de tabique de 101 mm. Incluida parte proporcional del resto de materiales: tornillería, pasta de juntas, masilla para encuentros perimetrales, fijaciones, junta estanca, etc. Montaje según norma de instalación UNE 102043 y exigencias del CTE.","Tabique formado por dos placas HIDRO de 13 mm de espesor compuestas por yeso natural, fibra de vidrio y aditivos inorgánicos que le aportan alta dureza y resistencia mecánica. Incorpora tratamiento hidrófugo, disminuyendo así su capacidad de absorción de agua (menor al 5%). Idónea para proteger las estancias de los efectos adversos de la humedad. Reacción al fuego: EUROCLASE A1. Sistema de galces desiguales: las placas encajan entre ellas dejando una entrecalle de 3 mm por donde se inserta la pasta de juntas. Este sistema no utiliza cinta de papel. La pasta de juntas se aplica en las cavidades de las placas y una masilla elástica en los encuentros. Atornillada a cada lado de una estructura metálica de acero galvanizado formada por canales de 50 mm y montantes de 51x49x49 mm con una modulación de 400 mm entre ejes, dando un ancho total de tabique de 101 mm. Incluida parte proporcional del resto de materiales: tornillería, pasta de juntas, masilla para encuentros perimetrales, fijaciones, junta estanca, etc. Montaje según norma de instalación UNE 102043 y exigencias del CTE.","Tabique formado por dos placas FUEGO de 13 mm de espesor compuestas por yeso natural, fibra de vidrio y aditivos inorgánicos que le aportan alta dureza y resistencia mecánica. Incorpora perlita y un aumento en la densidad que la hace idónea para un excelente comportamiento y resistencia frente al fuego. Reacción al fuego: EUROCLASE A1. Sistema de galces desiguales: las placas encajan entre ellas dejando una entrecalle de 3 mm por donde se inserta la pasta de juntas. Este sistema no utiliza cinta de papel. La pasta de juntas se aplica en las cavidades de las placas y una masilla elástica en los encuentros. Atornillada a cada lado de una estructura metálica de acero galvanizado formada por canales de 50 mm y montantes de 51x49x49 mm con una modulación de 400 mm entre ejes, dando un ancho total de tabique de 101 mm. Incluida parte proporcional del resto de materiales: tornillería, pasta de juntas, masilla para encuentros perimetrales, fijaciones, junta estanca, etc. Montaje según norma de instalación UNE 102043 y exigencias del CTE.","Tabique formado por dos placas RESIST de 13 mm de espesor compuestas por yeso natural, fibra de vidrio y aditivos inorgánicos que le aportan alta dureza y resistencia mecánica. Con mayor cantidad de fibra de vidrio y dosificación modificada, aumenta su densidad, mejorando notablemente la resistencia mecánica. Idónea para lugares con altas exigencias en cuanto a deterioro y desgaste. Reacción al fuego: EUROCLASE A1. Sistema de galces desiguales: las placas encajan entre ellas dejando una entrecalle de 3 mm por donde se inserta la pasta de juntas. Este sistema no utiliza cinta de papel. La pasta de juntas se aplica en las cavidades de las placas y una masilla elástica en los encuentros. Atornillada a cada lado de una estructura metálica de acero galvanizado formada por canales de 50 mm y montantes de 51x49x49 mm con una modulación de 400 mm entre ejes, dando un ancho total de tabique de 101 mm. Incluida parte proporcional del resto de materiales: tornillería, pasta de juntas, masilla para encuentros perimetrales, fijaciones, junta estanca, etc. Montaje según norma de instalación UNE 102043 y exigencias del CTE.","Tabique formado por dos placas HIDROPLUS de 13 mm de espesor compuestas por yeso natural, fibra de vidrio y aditivos inorgánicos que le aportan alta dureza y resistencia mecánica. Incorpora tratamiento hidrófugo y un aumento en su densidad, características claves para una elevada resistencia a la humedad (absorción de agua menor al 3%) y una gran resistencia mecánica. Idónea para zonas de intemperie. Reacción al fuego: EUROCLASE A1. Sistema de galces desiguales: las placas encajan entre ellas dejando una entrecalle de 3 mm por donde se inserta la pasta de juntas. Este sistema no utiliza cinta de papel. La pasta de juntas se aplica en las cavidades de las placas y una masilla elástica en los encuentros. Atornillada a cada lado de una estructura metálica de acero galvanizado formada por canales de 50 mm y montantes de 51x49x49 mm con una modulación de 400 mm entre ejes, dando un ancho total de tabique de 101 mm. Incluida parte proporcional del resto de materiales: tornillería, pasta de juntas, masilla para encuentros perimetrales, fijaciones, junta estanca, etc. Montaje según norma de instalación UNE 102043 y exigencias del CTE.","Tabique formado por dos placas SUPREM de 13 mm de espesor compuestas por yeso natural, fibra de vidrio y aditivos inorgánicos que le aportan alta dureza y resistencia mecánica. Incorpora tratamiento hidrófugo, perlita y un aumento en la densidad para conseguir soluciones constructivas que cumplan, altos requisitos frente al fuego y una capacidad reducida de absorción de agua. Reacción al fuego: EUROCLASE A1. Sistema de galces desiguales: las placas encajan entre ellas dejando una entrecalle de 3 mm por donde se inserta la pasta de juntas. Este sistema no utiliza cinta de papel. La pasta de juntas se aplica en las cavidades de las placas y una masilla elástica en los encuentros. Atornillada a cada lado de una estructura metálica de acero galvanizado formada por canales de 50 mm y montantes de 51x49x49 mm con una modulación de 400 mm entre ejes, dando un ancho total de tabique de 101 mm. Incluida parte proporcional del resto de materiales: tornillería, pasta de juntas, masilla para encuentros perimetrales, fijaciones, junta estanca, etc. Montaje según norma de instalación UNE 102043 y exigencias del CTE."]
[null,null,44960,"1.2.11","TABIQUE ATT® 109/400 (49)  [15+15+49+15+15]",400,49,30,"Tabique formado por dos placas BASIC de 15 mm de espesor compuestas por yeso natural, fibra de vidrio y aditivos inorgánicos que le aportan alta dureza y resistencia mecánica. Reacción al fuego: EUROCLASE A1. Sistema de galces desiguales: las placas encajan entre ellas dejando una entrecalle de 3 mm por donde se inserta la pasta de juntas. Este sistema no utiliza cinta de papel. La pasta de juntas se aplica en las cavidades de las placas y una masilla elástica en los encuentros. Atornillada a cada lado de una estructura metálica de acero galvanizado formada por canales de 50 mm y montantes de 51x49x49 mm con una modulación de 400 mm entre ejes, dando un ancho total de tabique de 109 mm. Incluida parte proporcional del resto de materiales: tornillería, pasta de juntas, masilla para encuentros perimetrales, fijaciones, junta estanca, etc. Montaje según norma de instalación UNE 102043 y exigencias del CTE.","Tabique formado por dos placas HIDRO de 15 mm de espesor compuestas por yeso natural, fibra de vidrio y aditivos inorgánicos que le aportan alta dureza y resistencia mecánica. Incorpora tratamiento hidrófugo, disminuyendo así su capacidad de absorción de agua (menor al 5%). Idónea para proteger las estancias de los efectos adversos de la humedad. Reacción al fuego: EUROCLASE A1. Sistema de galces desiguales: las placas encajan entre ellas dejando una entrecalle de 3 mm por donde se inserta la pasta de juntas. Este sistema no utiliza cinta de papel. La pasta de juntas se aplica en las cavidades de las placas y una masilla elástica en los encuentros. Atornillada a cada lado de una estructura metálica de acero galvanizado formada por canales de 50 mm y montantes de 51x49x49 mm con una modulación de 400 mm entre ejes, dando un ancho total de tabique de 109 mm. Incluida parte proporcional del resto de materiales: tornillería, pasta de juntas, masilla para encuentros perimetrales, fijaciones, junta estanca, etc. Montaje según norma de instalación UNE 102043 y exigencias del CTE.","Tabique formado por dos placas FUEGO de 15 mm de espesor compuestas por yeso natural, fibra de vidrio y aditivos inorgánicos que le aportan alta dureza y resistencia mecánica. Incorpora perlita y un aumento en la densidad que la hace idónea para un excelente comportamiento y resistencia frente al fuego. Reacción al fuego: EUROCLASE A1. Sistema de galces desiguales: las placas encajan entre ellas dejando una entrecalle de 3 mm por donde se inserta la pasta de juntas. Este sistema no utiliza cinta de papel. La pasta de juntas se aplica en las cavidades de las placas y una masilla elástica en los encuentros. Atornillada a cada lado de una estructura metálica de acero galvanizado formada por canales de 50 mm y montantes de 51x49x49 mm con una modulación de 400 mm entre ejes, dando un ancho total de tabique de 109 mm. Incluida parte proporcional del resto de materiales: tornillería, pasta de juntas, masilla para encuentros perimetrales, fijaciones, junta estanca, etc. Montaje según norma de instalación UNE 102043 y exigencias del CTE.","Tabique formado por dos placas RESIST de 15 mm de espesor compuestas por yeso natural, fibra de vidrio y aditivos inorgánicos que le aportan alta dureza y resistencia mecánica. Con mayor cantidad de fibra de vidrio y dosificación modificada, aumenta su densidad, mejorando notablemente la resistencia mecánica. Idónea para lugares con altas exigencias en cuanto a deterioro y desgaste. Reacción al fuego: EUROCLASE A1. Sistema de galces desiguales: las placas encajan entre ellas dejando una entrecalle de 3 mm por donde se inserta la pasta de juntas. Este sistema no utiliza cinta de papel. La pasta de juntas se aplica en las cavidades de las placas y una masilla elástica en los encuentros. Atornillada a cada lado de una estructura metálica de acero galvanizado formada por canales de 50 mm y montantes de 51x49x49 mm con una modulación de 400 mm entre ejes, dando un ancho total de tabique de 109 mm. Incluida parte proporcional del resto de materiales: tornillería, pasta de juntas, masilla para encuentros perimetrales, fijaciones, junta estanca, etc. Montaje según norma de instalación UNE 102043 y exigencias del CTE.","Tabique formado por dos placas HIDROPLUS de 15 mm de espesor compuestas por yeso natural, fibra de vidrio y aditivos inorgánicos que le aportan alta dureza y resistencia mecánica. Incorpora tratamiento hidrófugo y un aumento en su densidad, características claves para una elevada resistencia a la humedad (absorción de agua menor al 3%) y una gran resistencia mecánica. Idónea para zonas de intemperie. Reacción al fuego: EUROCLASE A1. Sistema de galces desiguales: las placas encajan entre ellas dejando una entrecalle de 3 mm por donde se inserta la pasta de juntas. Este sistema no utiliza cinta de papel. La pasta de juntas se aplica en las cavidades de las placas y una masilla elástica en los encuentros. Atornillada a cada lado de una estructura metálica de acero galvanizado formada por canales de 50 mm y montantes de 51x49x49 mm con una modulación de 400 mm entre ejes, dando un ancho total de tabique de 109 mm. Incluida parte proporcional del resto de materiales: tornillería, pasta de juntas, masilla para encuentros perimetrales, fijaciones, junta estanca, etc. Montaje según norma de instalación UNE 102043 y exigencias del CTE.","Tabique formado por dos placas SUPREM de 15 mm de espesor compuestas por yeso natural, fibra de vidrio y aditivos inorgánicos que le aportan alta dureza y resistencia mecánica. Incorpora tratamiento hidrófugo, perlita y un aumento en la densidad para conseguir soluciones constructivas que cumplan, altos requisitos frente al fuego y una capacidad reducida de absorción de agua. Reacción al fuego: EUROCLASE A1. Sistema de galces desiguales: las placas encajan entre ellas dejando una entrecalle de 3 mm por donde se inserta la pasta de juntas. Este sistema no utiliza cinta de papel. La pasta de juntas se aplica en las cavidades de las placas y una masilla elástica en los encuentros. Atornillada a cada lado de una estructura metálica de acero galvanizado formada por canales de 50 mm y montantes de 51x49x49 mm con una modulación de 400 mm entre ejes, dando un ancho total de tabique de 109 mm. Incluida parte proporcional del resto de materiales: tornillería, pasta de juntas, masilla para encuentros perimetrales, fijaciones, junta estanca, etc. Montaje según norma de instalación UNE 102043 y exigencias del CTE."]
[null,null,44980,"1.2.12","TABIQUE ATT® 129/400 (49)  [20+20+49+20+20]",400,49,40,"Tabique formado por dos placas BASIC de 20 mm de espesor compuestas por yeso natural, fibra de vidrio y aditivos inorgánicos que le aportan alta dureza y resistencia mecánica. Reacción al fuego: EUROCLASE A1. Sistema de galces desiguales: las placas encajan entre ellas dejando una entrecalle de 3 mm por donde se inserta la pasta de juntas. Este sistema no utiliza cinta de papel. La pasta de juntas se aplica en las cavidades de las placas y una masilla elástica en los encuentros. Atornillada a cada lado de una estructura metálica de acero galvanizado formada por canales de 50 mm y montantes de 51x49x49 mm con una modulación de 400 mm entre ejes, dando un ancho total de tabique de 129 mm. Incluida parte proporcional del resto de materiales: tornillería, pasta de juntas, masilla para encuentros perimetrales, fijaciones, junta estanca, etc. Montaje según norma de instalación UNE 102043 y exigencias del CTE.","Tabique formado por dos placas HIDRO de 20 mm de espesor compuestas por yeso natural, fibra de vidrio y aditivos inorgánicos que le aportan alta dureza y resistencia mecánica. Incorpora tratamiento hidrófugo, disminuyendo así su capacidad de absorción de agua (menor al 5%). Idónea para proteger las estancias de los efectos adversos de la humedad. Reacción al fuego: EUROCLASE A1. Sistema de galces desiguales: las placas encajan entre ellas dejando una entrecalle de 3 mm por donde se inserta la pasta de juntas. Este sistema no utiliza cinta de papel. La pasta de juntas se aplica en las cavidades de las placas y una masilla elástica en los encuentros. Atornillada a cada lado de una estructura metálica de acero galvanizado formada por canales de 50 mm y montantes de 51x49x49 mm con una modulación de 400 mm entre ejes, dando un ancho total de tabique de 129 mm. Incluida parte proporcional del resto de materiales: tornillería, pasta de juntas, masilla para encuentros perimetrales, fijaciones, junta estanca, etc. Montaje según norma de instalación UNE 102043 y exigencias del CTE.","Tabique formado por dos placas FUEGO de 20 mm de espesor compuestas por yeso natural, fibra de vidrio y aditivos inorgánicos que le aportan alta dureza y resistencia mecánica. Incorpora perlita y un aumento en la densidad que la hace idónea para un excelente comportamiento y resistencia frente al fuego. Reacción al fuego: EUROCLASE A1. Sistema de galces desiguales: las placas encajan entre ellas dejando una entrecalle de 3 mm por donde se inserta la pasta de juntas. Este sistema no utiliza cinta de papel. La pasta de juntas se aplica en las cavidades de las placas y una masilla elástica en los encuentros. Atornillada a cada lado de una estructura metálica de acero galvanizado formada por canales de 50 mm y montantes de 51x49x49 mm con una modulación de 400 mm entre ejes, dando un ancho total de tabique de 129 mm. Incluida parte proporcional del resto de materiales: tornillería, pasta de juntas, masilla para encuentros perimetrales, fijaciones, junta estanca, etc. Montaje según norma de instalación UNE 102043 y exigencias del CTE.","Tabique formado por dos placas RESIST de 20 mm de espesor compuestas por yeso natural, fibra de vidrio y aditivos inorgánicos que le aportan alta dureza y resistencia mecánica. Con mayor cantidad de fibra de vidrio y dosificación modificada, aumenta su densidad, mejorando notablemente la resistencia mecánica. Idónea para lugares con altas exigencias en cuanto a deterioro y desgaste. Reacción al fuego: EUROCLASE A1. Sistema de galces desiguales: las placas encajan entre ellas dejando una entrecalle de 3 mm por donde se inserta la pasta de juntas. Este sistema no utiliza cinta de papel. La pasta de juntas se aplica en las cavidades de las placas y una masilla elástica en los encuentros. Atornillada a cada lado de una estructura metálica de acero galvanizado formada por canales de 50 mm y montantes de 51x49x49 mm con una modulación de 400 mm entre ejes, dando un ancho total de tabique de 129 mm. Incluida parte proporcional del resto de materiales: tornillería, pasta de juntas, masilla para encuentros perimetrales, fijaciones, junta estanca, etc. Montaje según norma de instalación UNE 102043 y exigencias del CTE.","Tabique formado por dos placas HIDROPLUS de 20 mm de espesor compuestas por yeso natural, fibra de vidrio y aditivos inorgánicos que le aportan alta dureza y resistencia mecánica. Incorpora tratamiento hidrófugo y un aumento en su densidad, características claves para una elevada resistencia a la humedad (absorción de agua menor al 3%) y una gran resistencia mecánica. Idónea para zonas de intemperie. Reacción al fuego: EUROCLASE A1. Sistema de galces desiguales: las placas encajan entre ellas dejando una entrecalle de 3 mm por donde se inserta la pasta de juntas. Este sistema no utiliza cinta de papel. La pasta de juntas se aplica en las cavidades de las placas y una masilla elástica en los encuentros. Atornillada a cada lado de una estructura metálica de acero galvanizado formada por canales de 50 mm y montantes de 51x49x49 mm con una modulación de 400 mm entre ejes, dando un ancho total de tabique de 129 mm. Incluida parte proporcional del resto de materiales: tornillería, pasta de juntas, masilla para encuentros perimetrales, fijaciones, junta estanca, etc. Montaje según norma de instalación UNE 102043 y exigencias del CTE.","Tabique formado por dos placas SUPREM de 20 mm de espesor compuestas por yeso natural, fibra de vidrio y aditivos inorgánicos que le aportan alta dureza y resistencia mecánica. Incorpora tratamiento hidrófugo, perlita y un aumento en la densidad para conseguir soluciones constructivas que cumplan, altos requisitos frente al fuego y una capacidad reducida de absorción de agua. Reacción al fuego: EUROCLASE A1. Sistema de galces desiguales: las placas encajan entre ellas dejando una entrecalle de 3 mm por donde se inserta la pasta de juntas. Este sistema no utiliza cinta de papel. La pasta de juntas se aplica en las cavidades de las placas y una masilla elástica en los encuentros. Atornillada a cada lado de una estructura metálica de acero galvanizado formada por canales de 50 mm y montantes de 51x49x49 mm con una modulación de 400 mm entre ejes, dando un ancho total de tabique de 129 mm. Incluida parte proporcional del resto de materiales: tornillería, pasta de juntas, masilla para encuentros perimetrales, fijaciones, junta estanca, etc. Montaje según norma de instalación UNE 102043 y exigencias del CTE."]
[null,null,47452,"1.2.13","TABIQUE ATT® 126/400 (74)  [13+13+74+13+13]",400,74,26,"Tabique formado por dos placas BASIC de 13 mm de espesor compuestas por yeso natural, fibra de vidrio y aditivos inorgánicos que le aportan alta dureza y resistencia mecánica. Reacción al fuego: EUROCLASE A1. Sistema de galces desiguales: las placas encajan entre ellas dejando una entrecalle de 3 mm por donde se inserta la pasta de juntas. Este sistema no utiliza cinta de papel. La pasta de juntas se aplica en las cavidades de las placas y una masilla elástica en los encuentros. Atornillada a cada lado de una estructura metálica de acero galvanizado formada por canales de 75 mm y montantes de 51x74x49 mm con una modulación de 400 mm entre ejes, dando un ancho total de tabique de 126 mm. Incluida parte proporcional del resto de materiales: tornillería, pasta de juntas, masilla para encuentros perimetrales, fijaciones, junta estanca, etc. Montaje según norma de instalación UNE 102043 y exigencias del CTE.","Tabique formado por dos placas HIDRO de 13 mm de espesor compuestas por yeso natural, fibra de vidrio y aditivos inorgánicos que le aportan alta dureza y resistencia mecánica. Incorpora tratamiento hidrófugo, disminuyendo así su capacidad de absorción de agua (menor al 5%). Idónea para proteger las estancias de los efectos adversos de la humedad. Reacción al fuego: EUROCLASE A1. Sistema de galces desiguales: las placas encajan entre ellas dejando una entrecalle de 3 mm por donde se inserta la pasta de juntas. Este sistema no utiliza cinta de papel. La pasta de juntas se aplica en las cavidades de las placas y una masilla elástica en los encuentros. Atornillada a cada lado de una estructura metálica de acero galvanizado formada por canales de 75 mm y montantes de 51x74x49 mm con una modulación de 400 mm entre ejes, dando un ancho total de tabique de 126 mm. Incluida parte proporcional del resto de materiales: tornillería, pasta de juntas, masilla para encuentros perimetrales, fijaciones, junta estanca, etc. Montaje según norma de instalación UNE 102043 y exigencias del CTE.","Tabique formado por dos placas FUEGO de 13 mm de espesor compuestas por yeso natural, fibra de vidrio y aditivos inorgánicos que le aportan alta dureza y resistencia mecánica. Incorpora perlita y un aumento en la densidad que la hace idónea para un excelente comportamiento y resistencia frente al fuego. Reacción al fuego: EUROCLASE A1. Sistema de galces desiguales: las placas encajan entre ellas dejando una entrecalle de 3 mm por donde se inserta la pasta de juntas. Este sistema no utiliza cinta de papel. La pasta de juntas se aplica en las cavidades de las placas y una masilla elástica en los encuentros. Atornillada a cada lado de una estructura metálica de acero galvanizado formada por canales de 75 mm y montantes de 51x74x49 mm con una modulación de 400 mm entre ejes, dando un ancho total de tabique de 126 mm. Incluida parte proporcional del resto de materiales: tornillería, pasta de juntas, masilla para encuentros perimetrales, fijaciones, junta estanca, etc. Montaje según norma de instalación UNE 102043 y exigencias del CTE.","Tabique formado por dos placas RESIST de 13 mm de espesor compuestas por yeso natural, fibra de vidrio y aditivos inorgánicos que le aportan alta dureza y resistencia mecánica. Con mayor cantidad de fibra de vidrio y dosificación modificada, aumenta su densidad, mejorando notablemente la resistencia mecánica. Idónea para lugares con altas exigencias en cuanto a deterioro y desgaste. Reacción al fuego: EUROCLASE A1. Sistema de galces desiguales: las placas encajan entre ellas dejando una entrecalle de 3 mm por donde se inserta la pasta de juntas. Este sistema no utiliza cinta de papel. La pasta de juntas se aplica en las cavidades de las placas y una masilla elástica en los encuentros. Atornillada a cada lado de una estructura metálica de acero galvanizado formada por canales de 75 mm y montantes de 51x74x49 mm con una modulación de 400 mm entre ejes, dando un ancho total de tabique de 126 mm. Incluida parte proporcional del resto de materiales: tornillería, pasta de juntas, masilla para encuentros perimetrales, fijaciones, junta estanca, etc. Montaje según norma de instalación UNE 102043 y exigencias del CTE.","Tabique formado por dos placas HIDROPLUS de 13 mm de espesor compuestas por yeso natural, fibra de vidrio y aditivos inorgánicos que le aportan alta dureza y resistencia mecánica. Incorpora tratamiento hidrófugo y un aumento en su densidad, características claves para una elevada resistencia a la humedad (absorción de agua menor al 3%) y una gran resistencia mecánica. Idónea para zonas de intemperie. Reacción al fuego: EUROCLASE A1. Sistema de galces desiguales: las placas encajan entre ellas dejando una entrecalle de 3 mm por donde se inserta la pasta de juntas. Este sistema no utiliza cinta de papel. La pasta de juntas se aplica en las cavidades de las placas y una masilla elástica en los encuentros. Atornillada a cada lado de una estructura metálica de acero galvanizado formada por canales de 75 mm y montantes de 51x74x49 mm con una modulación de 400 mm entre ejes, dando un ancho total de tabique de 126 mm. Incluida parte proporcional del resto de materiales: tornillería, pasta de juntas, masilla para encuentros perimetrales, fijaciones, junta estanca, etc. Montaje según norma de instalación UNE 102043 y exigencias del CTE.","Tabique formado por dos placas SUPREM de 13 mm de espesor compuestas por yeso natural, fibra de vidrio y aditivos inorgánicos que le aportan alta dureza y resistencia mecánica. Incorpora tratamiento hidrófugo, perlita y un aumento en la densidad para conseguir soluciones constructivas que cumplan, altos requisitos frente al fuego y una capacidad reducida de absorción de agua. Reacción al fuego: EUROCLASE A1. Sistema de galces desiguales: las placas encajan entre ellas dejando una entrecalle de 3 mm por donde se inserta la pasta de juntas. Este sistema no utiliza cinta de papel. La pasta de juntas se aplica en las cavidades de las placas y una masilla elástica en los encuentros. Atornillada a cada lado de una estructura metálica de acero galvanizado formada por canales de 75 mm y montantes de 51x74x49 mm con una modulación de 400 mm entre ejes, dando un ancho total de tabique de 126 mm. Incluida parte proporcional del resto de materiales: tornillería, pasta de juntas, masilla para encuentros perimetrales, fijaciones, junta estanca, etc. Montaje según norma de instalación UNE 102043 y exigencias del CTE."]
[null,null,47460,"1.2.14","TABIQUE ATT® 134/400 (74)  [15+15+74+15+15]",400,74,30,"Tabique formado por dos placas BASIC de 15 mm de espesor compuestas por yeso natural, fibra de vidrio y aditivos inorgánicos que le aportan alta dureza y resistencia mecánica. Reacción al fuego: EUROCLASE A1. Sistema de galces desiguales: las placas encajan entre ellas dejando una entrecalle de 3 mm por donde se inserta la pasta de juntas. Este sistema no utiliza cinta de papel. La pasta de juntas se aplica en las cavidades de las placas y una masilla elástica en los encuentros. Atornillada a cada lado de una estructura metálica de acero galvanizado formada por canales de 75 mm y montantes de 51x74x49 mm con una modulación de 400 mm entre ejes, dando un ancho total de tabique de 134 mm. Incluida parte proporcional del resto de materiales: tornillería, pasta de juntas, masilla para encuentros perimetrales, fijaciones, junta estanca, etc. Montaje según norma de instalación UNE 102043 y exigencias del CTE.","Tabique formado por dos placas HIDRO de 15 mm de espesor compuestas por yeso natural, fibra de vidrio y aditivos inorgánicos que le aportan alta dureza y resistencia mecánica. Incorpora tratamiento hidrófugo, disminuyendo así su capacidad de absorción de agua (menor al 5%). Idónea para proteger las estancias de los efectos adversos de la humedad. Reacción al fuego: EUROCLASE A1. Sistema de galces desiguales: las placas encajan entre ellas dejando una entrecalle de 3 mm por donde se inserta la pasta de juntas. Este sistema no utiliza cinta de papel. La pasta de juntas se aplica en las cavidades de las placas y una masilla elástica en los encuentros. Atornillada a cada lado de una estructura metálica de acero galvanizado formada por canales de 75 mm y montantes de 51x74x49 mm con una modulación de 400 mm entre ejes, dando un ancho total de tabique de 134 mm. Incluida parte proporcional del resto de materiales: tornillería, pasta de juntas, masilla para encuentros perimetrales, fijaciones, junta estanca, etc. Montaje según norma de instalación UNE 102043 y exigencias del CTE.","Tabique formado por dos placas FUEGO de 15 mm de espesor compuestas por yeso natural, fibra de vidrio y aditivos inorgánicos que le aportan alta dureza y resistencia mecánica. Incorpora perlita y un aumento en la densidad que la hace idónea para un excelente comportamiento y resistencia frente al fuego. Reacción al fuego: EUROCLASE A1. Sistema de galces desiguales: las placas encajan entre ellas dejando una entrecalle de 3 mm por donde se inserta la pasta de juntas. Este sistema no utiliza cinta de papel. La pasta de juntas se aplica en las cavidades de las placas y una masilla elástica en los encuentros. Atornillada a cada lado de una estructura metálica de acero galvanizado formada por canales de 75 mm y montantes de 51x74x49 mm con una modulación de 400 mm entre ejes, dando un ancho total de tabique de 134 mm. Incluida parte proporcional del resto de materiales: tornillería, pasta de juntas, masilla para encuentros perimetrales, fijaciones, junta estanca, etc. Montaje según norma de instalación UNE 102043 y exigencias del CTE.","Tabique formado por dos placas RESIST de 15 mm de espesor compuestas por yeso natural, fibra de vidrio y aditivos inorgánicos que le aportan alta dureza y resistencia mecánica. Con mayor cantidad de fibra de vidrio y dosificación modificada, aumenta su densidad, mejorando notablemente la resistencia mecánica. Idónea para lugares con altas exigencias en cuanto a deterioro y desgaste. Reacción al fuego: EUROCLASE A1. Sistema de galces desiguales: las placas encajan entre ellas dejando una entrecalle de 3 mm por donde se inserta la pasta de juntas. Este sistema no utiliza cinta de papel. La pasta de juntas se aplica en las cavidades de las placas y una masilla elástica en los encuentros. Atornillada a cada lado de una estructura metálica de acero galvanizado formada por canales de 75 mm y montantes de 51x74x49 mm con una modulación de 400 mm entre ejes, dando un ancho total de tabique de 134 mm. Incluida parte proporcional del resto de materiales: tornillería, pasta de juntas, masilla para encuentros perimetrales, fijaciones, junta estanca, etc. Montaje según norma de instalación UNE 102043 y exigencias del CTE.","Tabique formado por dos placas HIDROPLUS de 15 mm de espesor compuestas por yeso natural, fibra de vidrio y aditivos inorgánicos que le aportan alta dureza y resistencia mecánica. Incorpora tratamiento hidrófugo y un aumento en su densidad, características claves para una elevada resistencia a la humedad (absorción de agua menor al 3%) y una gran resistencia mecánica. Idónea para zonas de intemperie. Reacción al fuego: EUROCLASE A1. Sistema de galces desiguales: las placas encajan entre ellas dejando una entrecalle de 3 mm por donde se inserta la pasta de juntas. Este sistema no utiliza cinta de papel. La pasta de juntas se aplica en las cavidades de las placas y una masilla elástica en los encuentros. Atornillada a cada lado de una estructura metálica de acero galvanizado formada por canales de 75 mm y montantes de 51x74x49 mm con una modulación de 400 mm entre ejes, dando un ancho total de tabique de 134 mm. Incluida parte proporcional del resto de materiales: tornillería, pasta de juntas, masilla para encuentros perimetrales, fijaciones, junta estanca, etc. Montaje según norma de instalación UNE 102043 y exigencias del CTE.","Tabique formado por dos placas SUPREM de 15 mm de espesor compuestas por yeso natural, fibra de vidrio y aditivos inorgánicos que le aportan alta dureza y resistencia mecánica. Incorpora tratamiento hidrófugo, perlita y un aumento en la densidad para conseguir soluciones constructivas que cumplan, altos requisitos frente al fuego y una capacidad reducida de absorción de agua. Reacción al fuego: EUROCLASE A1. Sistema de galces desiguales: las placas encajan entre ellas dejando una entrecalle de 3 mm por donde se inserta la pasta de juntas. Este sistema no utiliza cinta de papel. La pasta de juntas se aplica en las cavidades de las placas y una masilla elástica en los encuentros. Atornillada a cada lado de una estructura metálica de acero galvanizado formada por canales de 75 mm y montantes de 51x74x49 mm con una modulación de 400 mm entre ejes, dando un ancho total de tabique de 134 mm. Incluida parte proporcional del resto de materiales: tornillería, pasta de juntas, masilla para encuentros perimetrales, fijaciones, junta estanca, etc. Montaje según norma de instalación UNE 102043 y exigencias del CTE."]
[null,null,47480,"1.2.15","TABIQUE ATT® 154/400 (74)  [20+20+74+20+20]",400,74,40,"Tabique formado por dos placas BASIC de 20 mm de espesor compuestas por yeso natural, fibra de vidrio y aditivos inorgánicos que le aportan alta dureza y resistencia mecánica. Reacción al fuego: EUROCLASE A1. Sistema de galces desiguales: las placas encajan entre ellas dejando una entrecalle de 3 mm por donde se inserta la pasta de juntas. Este sistema no utiliza cinta de papel. La pasta de juntas se aplica en las cavidades de las placas y una masilla elástica en los encuentros. Atornillada a cada lado de una estructura metálica de acero galvanizado formada por canales de 75 mm y montantes de 51x74x49 mm con una modulación de 400 mm entre ejes, dando un ancho total de tabique de 154 mm. Incluida parte proporcional del resto de materiales: tornillería, pasta de juntas, masilla para encuentros perimetrales, fijaciones, junta estanca, etc. Montaje según norma de instalación UNE 102043 y exigencias del CTE.","Tabique formado por dos placas HIDRO de 20 mm de espesor compuestas por yeso natural, fibra de vidrio y aditivos inorgánicos que le aportan alta dureza y resistencia mecánica. Incorpora tratamiento hidrófugo, disminuyendo así su capacidad de absorción de agua (menor al 5%). Idónea para proteger las estancias de los efectos adversos de la humedad. Reacción al fuego: EUROCLASE A1. Sistema de galces desiguales: las placas encajan entre ellas dejando una entrecalle de 3 mm por donde se inserta la pasta de juntas. Este sistema no utiliza cinta de papel. La pasta de juntas se aplica en las cavidades de las placas y una masilla elástica en los encuentros. Atornillada a cada lado de una estructura metálica de acero galvanizado formada por canales de 75 mm y montantes de 51x74x49 mm con una modulación de 400 mm entre ejes, dando un ancho total de tabique de 154 mm. Incluida parte proporcional del resto de materiales: tornillería, pasta de juntas, masilla para encuentros perimetrales, fijaciones, junta estanca, etc. Montaje según norma de instalación UNE 102043 y exigencias del CTE.","Tabique formado por dos placas FUEGO de 20 mm de espesor compuestas por yeso natural, fibra de vidrio y aditivos inorgánicos que le aportan alta dureza y resistencia mecánica. Incorpora perlita y un aumento en la densidad que la hace idónea para un excelente comportamiento y resistencia frente al fuego. Reacción al fuego: EUROCLASE A1. Sistema de galces desiguales: las placas encajan entre ellas dejando una entrecalle de 3 mm por donde se inserta la pasta de juntas. Este sistema no utiliza cinta de papel. La pasta de juntas se aplica en las cavidades de las placas y una masilla elástica en los encuentros. Atornillada a cada lado de una estructura metálica de acero galvanizado formada por canales de 75 mm y montantes de 51x74x49 mm con una modulación de 400 mm entre ejes, dando un ancho total de tabique de 154 mm. Incluida parte proporcional del resto de materiales: tornillería, pasta de juntas, masilla para encuentros perimetrales, fijaciones, junta estanca, etc. Montaje según norma de instalación UNE 102043 y exigencias del CTE.","Tabique formado por dos placas RESIST de 20 mm de espesor compuestas por yeso natural, fibra de vidrio y aditivos inorgánicos que le aportan alta dureza y resistencia mecánica. Con mayor cantidad de fibra de vidrio y dosificación modificada, aumenta su densidad, mejorando notablemente la resistencia mecánica. Idónea para lugares con altas exigencias en cuanto a deterioro y desgaste. Reacción al fuego: EUROCLASE A1. Sistema de galces desiguales: las placas encajan entre ellas dejando una entrecalle de 3 mm por donde se inserta la pasta de juntas. Este sistema no utiliza cinta de papel. La pasta de juntas se aplica en las cavidades de las placas y una masilla elástica en los encuentros. Atornillada a cada lado de una estructura metálica de acero galvanizado formada por canales de 75 mm y montantes de 51x74x49 mm con una modulación de 400 mm entre ejes, dando un ancho total de tabique de 154 mm. Incluida parte proporcional del resto de materiales: tornillería, pasta de juntas, masilla para encuentros perimetrales, fijaciones, junta estanca, etc. Montaje según norma de instalación UNE 102043 y exigencias del CTE.","Tabique formado por dos placas HIDROPLUS de 20 mm de espesor compuestas por yeso natural, fibra de vidrio y aditivos inorgánicos que le aportan alta dureza y resistencia mecánica. Incorpora tratamiento hidrófugo y un aumento en su densidad, características claves para una elevada resistencia a la humedad (absorción de agua menor al 3%) y una gran resistencia mecánica. Idónea para zonas de intemperie. Reacción al fuego: EUROCLASE A1. Sistema de galces desiguales: las placas encajan entre ellas dejando una entrecalle de 3 mm por donde se inserta la pasta de juntas. Este sistema no utiliza cinta de papel. La pasta de juntas se aplica en las cavidades de las placas y una masilla elástica en los encuentros. Atornillada a cada lado de una estructura metálica de acero galvanizado formada por canales de 75 mm y montantes de 51x74x49 mm con una modulación de 400 mm entre ejes, dando un ancho total de tabique de 154 mm. Incluida parte proporcional del resto de materiales: tornillería, pasta de juntas, masilla para encuentros perimetrales, fijaciones, junta estanca, etc. Montaje según norma de instalación UNE 102043 y exigencias del CTE.","Tabique formado por dos placas SUPREM de 20 mm de espesor compuestas por yeso natural, fibra de vidrio y aditivos inorgánicos que le aportan alta dureza y resistencia mecánica. Incorpora tratamiento hidrófugo, perlita y un aumento en la densidad para conseguir soluciones constructivas que cumplan, altos requisitos frente al fuego y una capacidad reducida de absorción de agua. Reacción al fuego: EUROCLASE A1. Sistema de galces desiguales: las placas encajan entre ellas dejando una entrecalle de 3 mm por donde se inserta la pasta de juntas. Este sistema no utiliza cinta de papel. La pasta de juntas se aplica en las cavidades de las placas y una masilla elástica en los encuentros. Atornillada a cada lado de una estructura metálica de acero galvanizado formada por canales de 75 mm y montantes de 51x74x49 mm con una modulación de 400 mm entre ejes, dando un ancho total de tabique de 154 mm. Incluida parte proporcional del resto de materiales: tornillería, pasta de juntas, masilla para encuentros perimetrales, fijaciones, junta estanca, etc. Montaje según norma de instalación UNE 102043 y exigencias del CTE."]
[null,null,49952,"1.2.16","TABIQUE ATT® 151/400 (99)  [13+13+99+13+13]",400,99,26,"Tabique formado por dos placas BASIC de 13 mm de espesor compuestas por yeso natural, fibra de vidrio y aditivos inorgánicos que le aportan alta dureza y resistencia mecánica. Reacción al fuego: EUROCLASE A1. Sistema de galces desiguales: las placas encajan entre ellas dejando una entrecalle de 3 mm por donde se inserta la pasta de juntas. Este sistema no utiliza cinta de papel. La pasta de juntas se aplica en las cavidades de las placas y una masilla elástica en los encuentros. Atornillada a cada lado de una estructura metálica de acero galvanizado formada por canales de 100 mm y montantes de 51x99x49 mm con una modulación de 400 mm entre ejes, dando un ancho total de tabique de 151 mm. Incluida parte proporcional del resto de materiales: tornillería, pasta de juntas, masilla para encuentros perimetrales, fijaciones, junta estanca, etc. Montaje según norma de instalación UNE 102043 y exigencias del CTE.","Tabique formado por dos placas HIDRO de 13 mm de espesor compuestas por yeso natural, fibra de vidrio y aditivos inorgánicos que le aportan alta dureza y resistencia mecánica. Incorpora tratamiento hidrófugo, disminuyendo así su capacidad de absorción de agua (menor al 5%). Idónea para proteger las estancias de los efectos adversos de la humedad. Reacción al fuego: EUROCLASE A1. Sistema de galces desiguales: las placas encajan entre ellas dejando una entrecalle de 3 mm por donde se inserta la pasta de juntas. Este sistema no utiliza cinta de papel. La pasta de juntas se aplica en las cavidades de las placas y una masilla elástica en los encuentros. Atornillada a cada lado de una estructura metálica de acero galvanizado formada por canales de 100 mm y montantes de 51x99x49 mm con una modulación de 400 mm entre ejes, dando un ancho total de tabique de 151 mm. Incluida parte proporcional del resto de materiales: tornillería, pasta de juntas, masilla para encuentros perimetrales, fijaciones, junta estanca, etc. Montaje según norma de instalación UNE 102043 y exigencias del CTE.","Tabique formado por dos placas FUEGO de 13 mm de espesor compuestas por yeso natural, fibra de vidrio y aditivos inorgánicos que le aportan alta dureza y resistencia mecánica. Incorpora perlita y un aumento en la densidad que la hace idónea para un excelente comportamiento y resistencia frente al fuego. Reacción al fuego: EUROCLASE A1. Sistema de galces desiguales: las placas encajan entre ellas dejando una entrecalle de 3 mm por donde se inserta la pasta de juntas. Este sistema no utiliza cinta de papel. La pasta de juntas se aplica en las cavidades de las placas y una masilla elástica en los encuentros. Atornillada a cada lado de una estructura metálica de acero galvanizado formada por canales de 100 mm y montantes de 51x99x49 mm con una modulación de 400 mm entre ejes, dando un ancho total de tabique de 151 mm. Incluida parte proporcional del resto de materiales: tornillería, pasta de juntas, masilla para encuentros perimetrales, fijaciones, junta estanca, etc. Montaje según norma de instalación UNE 102043 y exigencias del CTE.","Tabique formado por dos placas RESIST de 13 mm de espesor compuestas por yeso natural, fibra de vidrio y aditivos inorgánicos que le aportan alta dureza y resistencia mecánica. Con mayor cantidad de fibra de vidrio y dosificación modificada, aumenta su densidad, mejorando notablemente la resistencia mecánica. Idónea para lugares con altas exigencias en cuanto a deterioro y desgaste. Reacción al fuego: EUROCLASE A1. Sistema de galces desiguales: las placas encajan entre ellas dejando una entrecalle de 3 mm por donde se inserta la pasta de juntas. Este sistema no utiliza cinta de papel. La pasta de juntas se aplica en las cavidades de las placas y una masilla elástica en los encuentros. Atornillada a cada lado de una estructura metálica de acero galvanizado formada por canales de 100 mm y montantes de 51x99x49 mm con una modulación de 400 mm entre ejes, dando un ancho total de tabique de 151 mm. Incluida parte proporcional del resto de materiales: tornillería, pasta de juntas, masilla para encuentros perimetrales, fijaciones, junta estanca, etc. Montaje según norma de instalación UNE 102043 y exigencias del CTE.","Tabique formado por dos placas HIDROPLUS de 13 mm de espesor compuestas por yeso natural, fibra de vidrio y aditivos inorgánicos que le aportan alta dureza y resistencia mecánica. Incorpora tratamiento hidrófugo y un aumento en su densidad, características claves para una elevada resistencia a la humedad (absorción de agua menor al 3%) y una gran resistencia mecánica. Idónea para zonas de intemperie. Reacción al fuego: EUROCLASE A1. Sistema de galces desiguales: las placas encajan entre ellas dejando una entrecalle de 3 mm por donde se inserta la pasta de juntas. Este sistema no utiliza cinta de papel. La pasta de juntas se aplica en las cavidades de las placas y una masilla elástica en los encuentros. Atornillada a cada lado de una estructura metálica de acero galvanizado formada por canales de 100 mm y montantes de 51x99x49 mm con una modulación de 400 mm entre ejes, dando un ancho total de tabique de 151 mm. Incluida parte proporcional del resto de materiales: tornillería, pasta de juntas, masilla para encuentros perimetrales, fijaciones, junta estanca, etc. Montaje según norma de instalación UNE 102043 y exigencias del CTE.","Tabique formado por dos placas SUPREM de 13 mm de espesor compuestas por yeso natural, fibra de vidrio y aditivos inorgánicos que le aportan alta dureza y resistencia mecánica. Incorpora tratamiento hidrófugo, perlita y un aumento en la densidad para conseguir soluciones constructivas que cumplan, altos requisitos frente al fuego y una capacidad reducida de absorción de agua. Reacción al fuego: EUROCLASE A1. Sistema de galces desiguales: las placas encajan entre ellas dejando una entrecalle de 3 mm por donde se inserta la pasta de juntas. Este sistema no utiliza cinta de papel. La pasta de juntas se aplica en las cavidades de las placas y una masilla elástica en los encuentros. Atornillada a cada lado de una estructura metálica de acero galvanizado formada por canales de 100 mm y montantes de 51x99x49 mm con una modulación de 400 mm entre ejes, dando un ancho total de tabique de 151 mm. Incluida parte proporcional del resto de materiales: tornillería, pasta de juntas, masilla para encuentros perimetrales, fijaciones, junta estanca, etc. Montaje según norma de instalación UNE 102043 y exigencias del CTE."]
[null,null,49960,"1.2.17","TABIQUE ATT® 159/400 (99)  [15+15+99+15+15]",400,99,30,"Tabique formado por dos placas BASIC de 15 mm de espesor compuestas por yeso natural, fibra de vidrio y aditivos inorgánicos que le aportan alta dureza y resistencia mecánica. Reacción al fuego: EUROCLASE A1. Sistema de galces desiguales: las placas encajan entre ellas dejando una entrecalle de 3 mm por donde se inserta la pasta de juntas. Este sistema no utiliza cinta de papel. La pasta de juntas se aplica en las cavidades de las placas y una masilla elástica en los encuentros. Atornillada a cada lado de una estructura metálica de acero galvanizado formada por canales de 100 mm y montantes de 51x99x49 mm con una modulación de 400 mm entre ejes, dando un ancho total de tabique de 159 mm. Incluida parte proporcional del resto de materiales: tornillería, pasta de juntas, masilla para encuentros perimetrales, fijaciones, junta estanca, etc. Montaje según norma de instalación UNE 102043 y exigencias del CTE.","Tabique formado por dos placas HIDRO de 15 mm de espesor compuestas por yeso natural, fibra de vidrio y aditivos inorgánicos que le aportan alta dureza y resistencia mecánica. Incorpora tratamiento hidrófugo, disminuyendo así su capacidad de absorción de agua (menor al 5%). Idónea para proteger las estancias de los efectos adversos de la humedad. Reacción al fuego: EUROCLASE A1. Sistema de galces desiguales: las placas encajan entre ellas dejando una entrecalle de 3 mm por donde se inserta la pasta de juntas. Este sistema no utiliza cinta de papel. La pasta de juntas se aplica en las cavidades de las placas y una masilla elástica en los encuentros. Atornillada a cada lado de una estructura metálica de acero galvanizado formada por canales de 100 mm y montantes de 51x99x49 mm con una modulación de 400 mm entre ejes, dando un ancho total de tabique de 159 mm. Incluida parte proporcional del resto de materiales: tornillería, pasta de juntas, masilla para encuentros perimetrales, fijaciones, junta estanca, etc. Montaje según norma de instalación UNE 102043 y exigencias del CTE.","Tabique formado por dos placas FUEGO de 15 mm de espesor compuestas por yeso natural, fibra de vidrio y aditivos inorgánicos que le aportan alta dureza y resistencia mecánica. Incorpora perlita y un aumento en la densidad que la hace idónea para un excelente comportamiento y resistencia frente al fuego. Reacción al fuego: EUROCLASE A1. Sistema de galces desiguales: las placas encajan entre ellas dejando una entrecalle de 3 mm por donde se inserta la pasta de juntas. Este sistema no utiliza cinta de papel. La pasta de juntas se aplica en las cavidades de las placas y una masilla elástica en los encuentros. Atornillada a cada lado de una estructura metálica de acero galvanizado formada por canales de 100 mm y montantes de 51x99x49 mm con una modulación de 400 mm entre ejes, dando un ancho total de tabique de 159 mm. Incluida parte proporcional del resto de materiales: tornillería, pasta de juntas, masilla para encuentros perimetrales, fijaciones, junta estanca, etc. Montaje según norma de instalación UNE 102043 y exigencias del CTE.","Tabique formado por dos placas RESIST de 15 mm de espesor compuestas por yeso natural, fibra de vidrio y aditivos inorgánicos que le aportan alta dureza y resistencia mecánica. Con mayor cantidad de fibra de vidrio y dosificación modificada, aumenta su densidad, mejorando notablemente la resistencia mecánica. Idónea para lugares con altas exigencias en cuanto a deterioro y desgaste. Reacción al fuego: EUROCLASE A1. Sistema de galces desiguales: las placas encajan entre ellas dejando una entrecalle de 3 mm por donde se inserta la pasta de juntas. Este sistema no utiliza cinta de papel. La pasta de juntas se aplica en las cavidades de las placas y una masilla elástica en los encuentros. Atornillada a cada lado de una estructura metálica de acero galvanizado formada por canales de 100 mm y montantes de 51x99x49 mm con una modulación de 400 mm entre ejes, dando un ancho total de tabique de 159 mm. Incluida parte proporcional del resto de materiales: tornillería, pasta de juntas, masilla para encuentros perimetrales, fijaciones, junta estanca, etc. Montaje según norma de instalación UNE 102043 y exigencias del CTE.","Tabique formado por dos placas HIDROPLUS de 15 mm de espesor compuestas por yeso natural, fibra de vidrio y aditivos inorgánicos que le aportan alta dureza y resistencia mecánica. Incorpora tratamiento hidrófugo y un aumento en su densidad, características claves para una elevada resistencia a la humedad (absorción de agua menor al 3%) y una gran resistencia mecánica. Idónea para zonas de intemperie. Reacción al fuego: EUROCLASE A1. Sistema de galces desiguales: las placas encajan entre ellas dejando una entrecalle de 3 mm por donde se inserta la pasta de juntas. Este sistema no utiliza cinta de papel. La pasta de juntas se aplica en las cavidades de las placas y una masilla elástica en los encuentros. Atornillada a cada lado de una estructura metálica de acero galvanizado formada por canales de 100 mm y montantes de 51x99x49 mm con una modulación de 400 mm entre ejes, dando un ancho total de tabique de 159 mm. Incluida parte proporcional del resto de materiales: tornillería, pasta de juntas, masilla para encuentros perimetrales, fijaciones, junta estanca, etc. Montaje según norma de instalación UNE 102043 y exigencias del CTE.","Tabique formado por dos placas SUPREM de 15 mm de espesor compuestas por yeso natural, fibra de vidrio y aditivos inorgánicos que le aportan alta dureza y resistencia mecánica. Incorpora tratamiento hidrófugo, perlita y un aumento en la densidad para conseguir soluciones constructivas que cumplan, altos requisitos frente al fuego y una capacidad reducida de absorción de agua. Reacción al fuego: EUROCLASE A1. Sistema de galces desiguales: las placas encajan entre ellas dejando una entrecalle de 3 mm por donde se inserta la pasta de juntas. Este sistema no utiliza cinta de papel. La pasta de juntas se aplica en las cavidades de las placas y una masilla elástica en los encuentros. Atornillada a cada lado de una estructura metálica de acero galvanizado formada por canales de 100 mm y montantes de 51x99x49 mm con una modulación de 400 mm entre ejes, dando un ancho total de tabique de 159 mm. Incluida parte proporcional del resto de materiales: tornillería, pasta de juntas, masilla para encuentros perimetrales, fijaciones, junta estanca, etc. Montaje según norma de instalación UNE 102043 y exigencias del CTE."]
[null,null,49980,"1.2.18","TABIQUE ATT® 179/400 (99)  [20+20+99+20+20]",400,99,40,"Tabique formado por dos placas BASIC de 20 mm de espesor compuestas por yeso natural, fibra de vidrio y aditivos inorgánicos que le aportan alta dureza y resistencia mecánica. Reacción al fuego: EUROCLASE A1. Sistema de galces desiguales: las placas encajan entre ellas dejando una entrecalle de 3 mm por donde se inserta la pasta de juntas. Este sistema no utiliza cinta de papel. La pasta de juntas se aplica en las cavidades de las placas y una masilla elástica en los encuentros. Atornillada a cada lado de una estructura metálica de acero galvanizado formada por canales de 100 mm y montantes de 51x99x49 mm con una modulación de 400 mm entre ejes, dando un ancho total de tabique de 179 mm. Incluida parte proporcional del resto de materiales: tornillería, pasta de juntas, masilla para encuentros perimetrales, fijaciones, junta estanca, etc. Montaje según norma de instalación UNE 102043 y exigencias del CTE.","Tabique formado por dos placas HIDRO de 20 mm de espesor compuestas por yeso natural, fibra de vidrio y aditivos inorgánicos que le aportan alta dureza y resistencia mecánica. Incorpora tratamiento hidrófugo, disminuyendo así su capacidad de absorción de agua (menor al 5%). Idónea para proteger las estancias de los efectos adversos de la humedad. Reacción al fuego: EUROCLASE A1. Sistema de galces desiguales: las placas encajan entre ellas dejando una entrecalle de 3 mm por donde se inserta la pasta de juntas. Este sistema no utiliza cinta de papel. La pasta de juntas se aplica en las cavidades de las placas y una masilla elástica en los encuentros. Atornillada a cada lado de una estructura metálica de acero galvanizado formada por canales de 100 mm y montantes de 51x99x49 mm con una modulación de 400 mm entre ejes, dando un ancho total de tabique de 179 mm. Incluida parte proporcional del resto de materiales: tornillería, pasta de juntas, masilla para encuentros perimetrales, fijaciones, junta estanca, etc. Montaje según norma de instalación UNE 102043 y exigencias del CTE.","Tabique formado por dos placas FUEGO de 20 mm de espesor compuestas por yeso natural, fibra de vidrio y aditivos inorgánicos que le aportan alta dureza y resistencia mecánica. Incorpora perlita y un aumento en la densidad que la hace idónea para un excelente comportamiento y resistencia frente al fuego. Reacción al fuego: EUROCLASE A1. Sistema de galces desiguales: las placas encajan entre ellas dejando una entrecalle de 3 mm por donde se inserta la pasta de juntas. Este sistema no utiliza cinta de papel. La pasta de juntas se aplica en las cavidades de las placas y una masilla elástica en los encuentros. Atornillada a cada lado de una estructura metálica de acero galvanizado formada por canales de 100 mm y montantes de 51x99x49 mm con una modulación de 400 mm entre ejes, dando un ancho total de tabique de 179 mm. Incluida parte proporcional del resto de materiales: tornillería, pasta de juntas, masilla para encuentros perimetrales, fijaciones, junta estanca, etc. Montaje según norma de instalación UNE 102043 y exigencias del CTE.","Tabique formado por dos placas RESIST de 20 mm de espesor compuestas por yeso natural, fibra de vidrio y aditivos inorgánicos que le aportan alta dureza y resistencia mecánica. Con mayor cantidad de fibra de vidrio y dosificación modificada, aumenta su densidad, mejorando notablemente la resistencia mecánica. Idónea para lugares con altas exigencias en cuanto a deterioro y desgaste. Reacción al fuego: EUROCLASE A1. Sistema de galces desiguales: las placas encajan entre ellas dejando una entrecalle de 3 mm por donde se inserta la pasta de juntas. Este sistema no utiliza cinta de papel. La pasta de juntas se aplica en las cavidades de las placas y una masilla elástica en los encuentros. Atornillada a cada lado de una estructura metálica de acero galvanizado formada por canales de 100 mm y montantes de 51x99x49 mm con una modulación de 400 mm entre ejes, dando un ancho total de tabique de 179 mm. Incluida parte proporcional del resto de materiales: tornillería, pasta de juntas, masilla para encuentros perimetrales, fijaciones, junta estanca, etc. Montaje según norma de instalación UNE 102043 y exigencias del CTE.","Tabique formado por dos placas HIDROPLUS de 20 mm de espesor compuestas por yeso natural, fibra de vidrio y aditivos inorgánicos que le aportan alta dureza y resistencia mecánica. Incorpora tratamiento hidrófugo y un aumento en su densidad, características claves para una elevada resistencia a la humedad (absorción de agua menor al 3%) y una gran resistencia mecánica. Idónea para zonas de intemperie. Reacción al fuego: EUROCLASE A1. Sistema de galces desiguales: las placas encajan entre ellas dejando una entrecalle de 3 mm por donde se inserta la pasta de juntas. Este sistema no utiliza cinta de papel. La pasta de juntas se aplica en las cavidades de las placas y una masilla elástica en los encuentros. Atornillada a cada lado de una estructura metálica de acero galvanizado formada por canales de 100 mm y montantes de 51x99x49 mm con una modulación de 400 mm entre ejes, dando un ancho total de tabique de 179 mm. Incluida parte proporcional del resto de materiales: tornillería, pasta de juntas, masilla para encuentros perimetrales, fijaciones, junta estanca, etc. Montaje según norma de instalación UNE 102043 y exigencias del CTE.","Tabique formado por dos placas SUPREM de 20 mm de espesor compuestas por yeso natural, fibra de vidrio y aditivos inorgánicos que le aportan alta dureza y resistencia mecánica. Incorpora tratamiento hidrófugo, perlita y un aumento en la densidad para conseguir soluciones constructivas que cumplan, altos requisitos frente al fuego y una capacidad reducida de absorción de agua. Reacción al fuego: EUROCLASE A1. Sistema de galces desiguales: las placas encajan entre ellas dejando una entrecalle de 3 mm por donde se inserta la pasta de juntas. Este sistema no utiliza cinta de papel. La pasta de juntas se aplica en las cavidades de las placas y una masilla elástica en los encuentros. Atornillada a cada lado de una estructura metálica de acero galvanizado formada por canales de 100 mm y montantes de 51x99x49 mm con una modulación de 400 mm entre ejes, dando un ancho total de tabique de 179 mm. Incluida parte proporcional del resto de materiales: tornillería, pasta de juntas, masilla para encuentros perimetrales, fijaciones, junta estanca, etc. Montaje según norma de instalación UNE 102043 y exigencias del CTE."]
[null,null,64978,"1.3.1","TABIQUE ATT® 127/600 (49)  [13+13+13+49+13+13+13]",600,49,{"$f":"3*13","v":39},"Tabique formado por tres placas BASIC de 13 mm de espesor compuestas por yeso natural, fibra de vidrio y aditivos inorgánicos que le aportan alta dureza y resistencia mecánica. Reacción al fuego: EUROCLASE A1. Sistema de galces desiguales: las placas encajan entre ellas dejando una entrecalle de 3 mm por donde se inserta la pasta de juntas. Este sistema no utiliza cinta de papel. La pasta de juntas se aplica en las cavidades de las placas y una masilla elástica en los encuentros. Atornillada a cada lado de una estructura metálica de acero galvanizado formada por canales de 50 mm y montantes de 51x49x49 mm con una modulación de 600 mm entre ejes, dando un ancho total de tabique de 127 mm. Incluida parte proporcional del resto de materiales: tornillería, pasta de juntas, masilla para encuentros perimetrales, fijaciones, junta estanca, etc. Montaje según norma de instalación UNE 102043 y exigencias del CTE.","Tabique formado por tres placas HIDRO de 13 mm de espesor compuestas por yeso natural, fibra de vidrio y aditivos inorgánicos que le aportan alta dureza y resistencia mecánica. Incorpora tratamiento hidrófugo, disminuyendo así su capacidad de absorción de agua (menor al 5%). Idónea para proteger las estancias de los efectos adversos de la humedad. Reacción al fuego: EUROCLASE A1. Sistema de galces desiguales: las placas encajan entre ellas dejando una entrecalle de 3 mm por donde se inserta la pasta de juntas. Este sistema no utiliza cinta de papel. La pasta de juntas se aplica en las cavidades de las placas y una masilla elástica en los encuentros. Atornillada a cada lado de una estructura metálica de acero galvanizado formada por canales de 50 mm y montantes de 51x49x49 mm con una modulación de 600 mm entre ejes, dando un ancho total de tabique de 127 mm. Incluida parte proporcional del resto de materiales: tornillería, pasta de juntas, masilla para encuentros perimetrales, fijaciones, junta estanca, etc. Montaje según norma de instalación UNE 102043 y exigencias del CTE.","Tabique formado por tres placas FUEGO de 13 mm de espesor compuestas por yeso natural, fibra de vidrio y aditivos inorgánicos que le aportan alta dureza y resistencia mecánica. Incorpora perlita y un aumento en la densidad que la hace idónea para un excelente comportamiento y resistencia frente al fuego. Reacción al fuego: EUROCLASE A1. Sistema de galces desiguales: las placas encajan entre ellas dejando una entrecalle de 3 mm por donde se inserta la pasta de juntas. Este sistema no utiliza cinta de papel. La pasta de juntas se aplica en las cavidades de las placas y una masilla elástica en los encuentros. Atornillada a cada lado de una estructura metálica de acero galvanizado formada por canales de 50 mm y montantes de 51x49x49 mm con una modulación de 600 mm entre ejes, dando un ancho total de tabique de 127 mm. Incluida parte proporcional del resto de materiales: tornillería, pasta de juntas, masilla para encuentros perimetrales, fijaciones, junta estanca, etc. Montaje según norma de instalación UNE 102043 y exigencias del CTE.","Tabique formado por tres placas RESIST de 13 mm de espesor compuestas por yeso natural, fibra de vidrio y aditivos inorgánicos que le aportan alta dureza y resistencia mecánica. Con mayor cantidad de fibra de vidrio y dosificación modificada, aumenta su densidad, mejorando notablemente la resistencia mecánica. Idónea para lugares con altas exigencias en cuanto a deterioro y desgaste. Reacción al fuego: EUROCLASE A1. Sistema de galces desiguales: las placas encajan entre ellas dejando una entrecalle de 3 mm por donde se inserta la pasta de juntas. Este sistema no utiliza cinta de papel. La pasta de juntas se aplica en las cavidades de las placas y una masilla elástica en los encuentros. Atornillada a cada lado de una estructura metálica de acero galvanizado formada por canales de 50 mm y montantes de 51x49x49 mm con una modulación de 600 mm entre ejes, dando un ancho total de tabique de 127 mm. Incluida parte proporcional del resto de materiales: tornillería, pasta de juntas, masilla para encuentros perimetrales, fijaciones, junta estanca, etc. Montaje según norma de instalación UNE 102043 y exigencias del CTE.","Tabique formado por tres placas HIDROPLUS de 13 mm de espesor compuestas por yeso natural, fibra de vidrio y aditivos inorgánicos que le aportan alta dureza y resistencia mecánica. Incorpora tratamiento hidrófugo y un aumento en su densidad, características claves para una elevada resistencia a la humedad (absorción de agua menor al 3%) y una gran resistencia mecánica. Idónea para zonas de intemperie. Reacción al fuego: EUROCLASE A1. Sistema de galces desiguales: las placas encajan entre ellas dejando una entrecalle de 3 mm por donde se inserta la pasta de juntas. Este sistema no utiliza cinta de papel. La pasta de juntas se aplica en las cavidades de las placas y una masilla elástica en los encuentros. Atornillada a cada lado de una estructura metálica de acero galvanizado formada por canales de 50 mm y montantes de 51x49x49 mm con una modulación de 600 mm entre ejes, dando un ancho total de tabique de 127 mm. Incluida parte proporcional del resto de materiales: tornillería, pasta de juntas, masilla para encuentros perimetrales, fijaciones, junta estanca, etc. Montaje según norma de instalación UNE 102043 y exigencias del CTE.","Tabique formado por tres placas SUPREM de 13 mm de espesor compuestas por yeso natural, fibra de vidrio y aditivos inorgánicos que le aportan alta dureza y resistencia mecánica. Incorpora tratamiento hidrófugo, perlita y un aumento en la densidad para conseguir soluciones constructivas que cumplan, altos requisitos frente al fuego y una capacidad reducida de absorción de agua. Reacción al fuego: EUROCLASE A1. Sistema de galces desiguales: las placas encajan entre ellas dejando una entrecalle de 3 mm por donde se inserta la pasta de juntas. Este sistema no utiliza cinta de papel. La pasta de juntas se aplica en las cavidades de las placas y una masilla elástica en los encuentros. Atornillada a cada lado de una estructura metálica de acero galvanizado formada por canales de 50 mm y montantes de 51x49x49 mm con una modulación de 600 mm entre ejes, dando un ancho total de tabique de 127 mm. Incluida parte proporcional del resto de materiales: tornillería, pasta de juntas, masilla para encuentros perimetrales, fijaciones, junta estanca, etc. Montaje según norma de instalación UNE 102043 y exigencias del CTE."]
[null,null,64990,"1.3.2","TABIQUE ATT® 139/600 (49)  [15+15+15+49+15+15+15]",600,49,{"$f":"3*15","v":45},"Tabique formado por tres placas BASIC de 15 mm de espesor compuestas por yeso natural, fibra de vidrio y aditivos inorgánicos que le aportan alta dureza y resistencia mecánica. Reacción al fuego: EUROCLASE A1. Sistema de galces desiguales: las placas encajan entre ellas dejando una entrecalle de 3 mm por donde se inserta la pasta de juntas. Este sistema no utiliza cinta de papel. La pasta de juntas se aplica en las cavidades de las placas y una masilla elástica en los encuentros. Atornillada a cada lado de una estructura metálica de acero galvanizado formada por canales de 50 mm y montantes de 51x49x49 mm con una modulación de 600 mm entre ejes, dando un ancho total de tabique de 139 mm. Incluida parte proporcional del resto de materiales: tornillería, pasta de juntas, masilla para encuentros perimetrales, fijaciones, junta estanca, etc. Montaje según norma de instalación UNE 102043 y exigencias del CTE.","Tabique formado por tres placas HIDRO de 15 mm de espesor compuestas por yeso natural, fibra de vidrio y aditivos inorgánicos que le aportan alta dureza y resistencia mecánica. Incorpora tratamiento hidrófugo, disminuyendo así su capacidad de absorción de agua (menor al 5%). Idónea para proteger las estancias de los efectos adversos de la humedad. Reacción al fuego: EUROCLASE A1. Sistema de galces desiguales: las placas encajan entre ellas dejando una entrecalle de 3 mm por donde se inserta la pasta de juntas. Este sistema no utiliza cinta de papel. La pasta de juntas se aplica en las cavidades de las placas y una masilla elástica en los encuentros. Atornillada a cada lado de una estructura metálica de acero galvanizado formada por canales de 50 mm y montantes de 51x49x49 mm con una modulación de 600 mm entre ejes, dando un ancho total de tabique de 139 mm. Incluida parte proporcional del resto de materiales: tornillería, pasta de juntas, masilla para encuentros perimetrales, fijaciones, junta estanca, etc. Montaje según norma de instalación UNE 102043 y exigencias del CTE.","Tabique formado por tres placas FUEGO de 15 mm de espesor compuestas por yeso natural, fibra de vidrio y aditivos inorgánicos que le aportan alta dureza y resistencia mecánica. Incorpora perlita y un aumento en la densidad que la hace idónea para un excelente comportamiento y resistencia frente al fuego. Reacción al fuego: EUROCLASE A1. Sistema de galces desiguales: las placas encajan entre ellas dejando una entrecalle de 3 mm por donde se inserta la pasta de juntas. Este sistema no utiliza cinta de papel. La pasta de juntas se aplica en las cavidades de las placas y una masilla elástica en los encuentros. Atornillada a cada lado de una estructura metálica de acero galvanizado formada por canales de 50 mm y montantes de 51x49x49 mm con una modulación de 600 mm entre ejes, dando un ancho total de tabique de 139 mm. Incluida parte proporcional del resto de materiales: tornillería, pasta de juntas, masilla para encuentros perimetrales, fijaciones, junta estanca, etc. Montaje según norma de instalación UNE 102043 y exigencias del CTE.","Tabique formado por tres placas RESIST de 15 mm de espesor compuestas por yeso natural, fibra de vidrio y aditivos inorgánicos que le aportan alta dureza y resistencia mecánica. Con mayor cantidad de fibra de vidrio y dosificación modificada, aumenta su densidad, mejorando notablemente la resistencia mecánica. Idónea para lugares con altas exigencias en cuanto a deterioro y desgaste. Reacción al fuego: EUROCLASE A1. Sistema de galces desiguales: las placas encajan entre ellas dejando una entrecalle de 3 mm por donde se inserta la pasta de juntas. Este sistema no utiliza cinta de papel. La pasta de juntas se aplica en las cavidades de las placas y una masilla elástica en los encuentros. Atornillada a cada lado de una estructura metálica de acero galvanizado formada por canales de 50 mm y montantes de 51x49x49 mm con una modulación de 600 mm entre ejes, dando un ancho total de tabique de 139 mm. Incluida parte proporcional del resto de materiales: tornillería, pasta de juntas, masilla para encuentros perimetrales, fijaciones, junta estanca, etc. Montaje según norma de instalación UNE 102043 y exigencias del CTE.","Tabique formado por tres placas HIDROPLUS de 15 mm de espesor compuestas por yeso natural, fibra de vidrio y aditivos inorgánicos que le aportan alta dureza y resistencia mecánica. Incorpora tratamiento hidrófugo y un aumento en su densidad, características claves para una elevada resistencia a la humedad (absorción de agua menor al 3%) y una gran resistencia mecánica. Idónea para zonas de intemperie. Reacción al fuego: EUROCLASE A1. Sistema de galces desiguales: las placas encajan entre ellas dejando una entrecalle de 3 mm por donde se inserta la pasta de juntas. Este sistema no utiliza cinta de papel. La pasta de juntas se aplica en las cavidades de las placas y una masilla elástica en los encuentros. Atornillada a cada lado de una estructura metálica de acero galvanizado formada por canales de 50 mm y montantes de 51x49x49 mm con una modulación de 600 mm entre ejes, dando un ancho total de tabique de 139 mm. Incluida parte proporcional del resto de materiales: tornillería, pasta de juntas, masilla para encuentros perimetrales, fijaciones, junta estanca, etc. Montaje según norma de instalación UNE 102043 y exigencias del CTE.","Tabique formado por tres placas SUPREM de 15 mm de espesor compuestas por yeso natural, fibra de vidrio y aditivos inorgánicos que le aportan alta dureza y resistencia mecánica. Incorpora tratamiento hidrófugo, perlita y un aumento en la densidad para conseguir soluciones constructivas que cumplan, altos requisitos frente al fuego y una capacidad reducida de absorción de agua. Reacción al fuego: EUROCLASE A1. Sistema de galces desiguales: las placas encajan entre ellas dejando una entrecalle de 3 mm por donde se inserta la pasta de juntas. Este sistema no utiliza cinta de papel. La pasta de juntas se aplica en las cavidades de las placas y una masilla elástica en los encuentros. Atornillada a cada lado de una estructura metálica de acero galvanizado formada por canales de 50 mm y montantes de 51x49x49 mm con una modulación de 600 mm entre ejes, dando un ancho total de tabique de 139 mm. Incluida parte proporcional del resto de materiales: tornillería, pasta de juntas, masilla para encuentros perimetrales, fijaciones, junta estanca, etc. Montaje según norma de instalación UNE 102043 y exigencias del CTE."]
[null,null,65020,"1.3.3","TABIQUE ATT® 169/600 (49)  [20+20+20+49+20+20+20]",600,49,{"$f":"3*20","v":60},"Tabique formado por tres placas BASIC de 20 mm de espesor compuestas por yeso natural, fibra de vidrio y aditivos inorgánicos que le aportan alta dureza y resistencia mecánica. Reacción al fuego: EUROCLASE A1. Sistema de galces desiguales: las placas encajan entre ellas dejando una entrecalle de 3 mm por donde se inserta la pasta de juntas. Este sistema no utiliza cinta de papel. La pasta de juntas se aplica en las cavidades de las placas y una masilla elástica en los encuentros. Atornillada a cada lado de una estructura metálica de acero galvanizado formada por canales de 50 mm y montantes de 51x49x49 mm con una modulación de 600 mm entre ejes, dando un ancho total de tabique de 169 mm. Incluida parte proporcional del resto de materiales: tornillería, pasta de juntas, masilla para encuentros perimetrales, fijaciones, junta estanca, etc. Montaje según norma de instalación UNE 102043 y exigencias del CTE.","Tabique formado por tres placas HIDRO de 20 mm de espesor compuestas por yeso natural, fibra de vidrio y aditivos inorgánicos que le aportan alta dureza y resistencia mecánica. Incorpora tratamiento hidrófugo, disminuyendo así su capacidad de absorción de agua (menor al 5%). Idónea para proteger las estancias de los efectos adversos de la humedad. Reacción al fuego: EUROCLASE A1. Sistema de galces desiguales: las placas encajan entre ellas dejando una entrecalle de 3 mm por donde se inserta la pasta de juntas. Este sistema no utiliza cinta de papel. La pasta de juntas se aplica en las cavidades de las placas y una masilla elástica en los encuentros. Atornillada a cada lado de una estructura metálica de acero galvanizado formada por canales de 50 mm y montantes de 51x49x49 mm con una modulación de 600 mm entre ejes, dando un ancho total de tabique de 169 mm. Incluida parte proporcional del resto de materiales: tornillería, pasta de juntas, masilla para encuentros perimetrales, fijaciones, junta estanca, etc. Montaje según norma de instalación UNE 102043 y exigencias del CTE.","Tabique formado por tres placas FUEGO de 20 mm de espesor compuestas por yeso natural, fibra de vidrio y aditivos inorgánicos que le aportan alta dureza y resistencia mecánica. Incorpora perlita y un aumento en la densidad que la hace idónea para un excelente comportamiento y resistencia frente al fuego. Reacción al fuego: EUROCLASE A1. Sistema de galces desiguales: las placas encajan entre ellas dejando una entrecalle de 3 mm por donde se inserta la pasta de juntas. Este sistema no utiliza cinta de papel. La pasta de juntas se aplica en las cavidades de las placas y una masilla elástica en los encuentros. Atornillada a cada lado de una estructura metálica de acero galvanizado formada por canales de 50 mm y montantes de 51x49x49 mm con una modulación de 600 mm entre ejes, dando un ancho total de tabique de 169 mm. Incluida parte proporcional del resto de materiales: tornillería, pasta de juntas, masilla para encuentros perimetrales, fijaciones, junta estanca, etc. Montaje según norma de instalación UNE 102043 y exigencias del CTE.","Tabique formado por tres placas RESIST de 20 mm de espesor compuestas por yeso natural, fibra de vidrio y aditivos inorgánicos que le aportan alta dureza y resistencia mecánica. Con mayor cantidad de fibra de vidrio y dosificación modificada, aumenta su densidad, mejorando notablemente la resistencia mecánica. Idónea para lugares con altas exigencias en cuanto a deterioro y desgaste. Reacción al fuego: EUROCLASE A1. Sistema de galces desiguales: las placas encajan entre ellas dejando una entrecalle de 3 mm por donde se inserta la pasta de juntas. Este sistema no utiliza cinta de papel. La pasta de juntas se aplica en las cavidades de las placas y una masilla elástica en los encuentros. Atornillada a cada lado de una estructura metálica de acero galvanizado formada por canales de 50 mm y montantes de 51x49x49 mm con una modulación de 600 mm entre ejes, dando un ancho total de tabique de 169 mm. Incluida parte proporcional del resto de materiales: tornillería, pasta de juntas, masilla para encuentros perimetrales, fijaciones, junta estanca, etc. Montaje según norma de instalación UNE 102043 y exigencias del CTE.","Tabique formado por tres placas HIDROPLUS de 20 mm de espesor compuestas por yeso natural, fibra de vidrio y aditivos inorgánicos que le aportan alta dureza y resistencia mecánica. Incorpora tratamiento hidrófugo y un aumento en su densidad, características claves para una elevada resistencia a la humedad (absorción de agua menor al 3%) y una gran resistencia mecánica. Idónea para zonas de intemperie. Reacción al fuego: EUROCLASE A1. Sistema de galces desiguales: las placas encajan entre ellas dejando una entrecalle de 3 mm por donde se inserta la pasta de juntas. Este sistema no utiliza cinta de papel. La pasta de juntas se aplica en las cavidades de las placas y una masilla elástica en los encuentros. Atornillada a cada lado de una estructura metálica de acero galvanizado formada por canales de 50 mm y montantes de 51x49x49 mm con una modulación de 600 mm entre ejes, dando un ancho total de tabique de 169 mm. Incluida parte proporcional del resto de materiales: tornillería, pasta de juntas, masilla para encuentros perimetrales, fijaciones, junta estanca, etc. Montaje según norma de instalación UNE 102043 y exigencias del CTE.","Tabique formado por tres placas SUPREM de 20 mm de espesor compuestas por yeso natural, fibra de vidrio y aditivos inorgánicos que le aportan alta dureza y resistencia mecánica. Incorpora tratamiento hidrófugo, perlita y un aumento en la densidad para conseguir soluciones constructivas que cumplan, altos requisitos frente al fuego y una capacidad reducida de absorción de agua. Reacción al fuego: EUROCLASE A1. Sistema de galces desiguales: las placas encajan entre ellas dejando una entrecalle de 3 mm por donde se inserta la pasta de juntas. Este sistema no utiliza cinta de papel. La pasta de juntas se aplica en las cavidades de las placas y una masilla elástica en los encuentros. Atornillada a cada lado de una estructura metálica de acero galvanizado formada por canales de 50 mm y montantes de 51x49x49 mm con una modulación de 600 mm entre ejes, dando un ancho total de tabique de 169 mm. Incluida parte proporcional del resto de materiales: tornillería, pasta de juntas, masilla para encuentros perimetrales, fijaciones, junta estanca, etc. Montaje según norma de instalación UNE 102043 y exigencias del CTE."]
[null,null,67478,"1.3.4","TABIQUE ATT® 152/600 (74)  [13+13+13+74+13+13+13]",600,74,{"$f":"3*13","v":39},"Tabique formado por tres placas BASIC de 13 mm de espesor compuestas por yeso natural, fibra de vidrio y aditivos inorgánicos que le aportan alta dureza y resistencia mecánica. Reacción al fuego: EUROCLASE A1. Sistema de galces desiguales: las placas encajan entre ellas dejando una entrecalle de 3 mm por donde se inserta la pasta de juntas. Este sistema no utiliza cinta de papel. La pasta de juntas se aplica en las cavidades de las placas y una masilla elástica en los encuentros. Atornillada a cada lado de una estructura metálica de acero galvanizado formada por canales de 75 mm y montantes de 51x74x49 mm con una modulación de 600 mm entre ejes, dando un ancho total de tabique de 152 mm. Incluida parte proporcional del resto de materiales: tornillería, pasta de juntas, masilla para encuentros perimetrales, fijaciones, junta estanca, etc. Montaje según norma de instalación UNE 102043 y exigencias del CTE.","Tabique formado por tres placas HIDRO de 13 mm de espesor compuestas por yeso natural, fibra de vidrio y aditivos inorgánicos que le aportan alta dureza y resistencia mecánica. Incorpora tratamiento hidrófugo, disminuyendo así su capacidad de absorción de agua (menor al 5%). Idónea para proteger las estancias de los efectos adversos de la humedad. Reacción al fuego: EUROCLASE A1. Sistema de galces desiguales: las placas encajan entre ellas dejando una entrecalle de 3 mm por donde se inserta la pasta de juntas. Este sistema no utiliza cinta de papel. La pasta de juntas se aplica en las cavidades de las placas y una masilla elástica en los encuentros. Atornillada a cada lado de una estructura metálica de acero galvanizado formada por canales de 75 mm y montantes de 51x74x49 mm con una modulación de 600 mm entre ejes, dando un ancho total de tabique de 152 mm. Incluida parte proporcional del resto de materiales: tornillería, pasta de juntas, masilla para encuentros perimetrales, fijaciones, junta estanca, etc. Montaje según norma de instalación UNE 102043 y exigencias del CTE.","Tabique formado por tres placas FUEGO de 13 mm de espesor compuestas por yeso natural, fibra de vidrio y aditivos inorgánicos que le aportan alta dureza y resistencia mecánica. Incorpora perlita y un aumento en la densidad que la hace idónea para un excelente comportamiento y resistencia frente al fuego. Reacción al fuego: EUROCLASE A1. Sistema de galces desiguales: las placas encajan entre ellas dejando una entrecalle de 3 mm por donde se inserta la pasta de juntas. Este sistema no utiliza cinta de papel. La pasta de juntas se aplica en las cavidades de las placas y una masilla elástica en los encuentros. Atornillada a cada lado de una estructura metálica de acero galvanizado formada por canales de 75 mm y montantes de 51x74x49 mm con una modulación de 600 mm entre ejes, dando un ancho total de tabique de 152 mm. Incluida parte proporcional del resto de materiales: tornillería, pasta de juntas, masilla para encuentros perimetrales, fijaciones, junta estanca, etc. Montaje según norma de instalación UNE 102043 y exigencias del CTE.","Tabique formado por tres placas RESIST de 13 mm de espesor compuestas por yeso natural, fibra de vidrio y aditivos inorgánicos que le aportan alta dureza y resistencia mecánica. Con mayor cantidad de fibra de vidrio y dosificación modificada, aumenta su densidad, mejorando notablemente la resistencia mecánica. Idónea para lugares con altas exigencias en cuanto a deterioro y desgaste. Reacción al fuego: EUROCLASE A1. Sistema de galces desiguales: las placas encajan entre ellas dejando una entrecalle de 3 mm por donde se inserta la pasta de juntas. Este sistema no utiliza cinta de papel. La pasta de juntas se aplica en las cavidades de las placas y una masilla elástica en los encuentros. Atornillada a cada lado de una estructura metálica de acero galvanizado formada por canales de 75 mm y montantes de 51x74x49 mm con una modulación de 600 mm entre ejes, dando un ancho total de tabique de 152 mm. Incluida parte proporcional del resto de materiales: tornillería, pasta de juntas, masilla para encuentros perimetrales, fijaciones, junta estanca, etc. Montaje según norma de instalación UNE 102043 y exigencias del CTE.","Tabique formado por tres placas HIDROPLUS de 13 mm de espesor compuestas por yeso natural, fibra de vidrio y aditivos inorgánicos que le aportan alta dureza y resistencia mecánica. Incorpora tratamiento hidrófugo y un aumento en su densidad, características claves para una elevada resistencia a la humedad (absorción de agua menor al 3%) y una gran resistencia mecánica. Idónea para zonas de intemperie. Reacción al fuego: EUROCLASE A1. Sistema de galces desiguales: las placas encajan entre ellas dejando una entrecalle de 3 mm por donde se inserta la pasta de juntas. Este sistema no utiliza cinta de papel. La pasta de juntas se aplica en las cavidades de las placas y una masilla elástica en los encuentros. Atornillada a cada lado de una estructura metálica de acero galvanizado formada por canales de 75 mm y montantes de 51x74x49 mm con una modulación de 600 mm entre ejes, dando un ancho total de tabique de 152 mm. Incluida parte proporcional del resto de materiales: tornillería, pasta de juntas, masilla para encuentros perimetrales, fijaciones, junta estanca, etc. Montaje según norma de instalación UNE 102043 y exigencias del CTE.","Tabique formado por tres placas SUPREM de 13 mm de espesor compuestas por yeso natural, fibra de vidrio y aditivos inorgánicos que le aportan alta dureza y resistencia mecánica. Incorpora tratamiento hidrófugo, perlita y un aumento en la densidad para conseguir soluciones constructivas que cumplan, altos requisitos frente al fuego y una capacidad reducida de absorción de agua. Reacción al fuego: EUROCLASE A1. Sistema de galces desiguales: las placas encajan entre ellas dejando una entrecalle de 3 mm por donde se inserta la pasta de juntas. Este sistema no utiliza cinta de papel. La pasta de juntas se aplica en las cavidades de las placas y una masilla elástica en los encuentros. Atornillada a cada lado de una estructura metálica de acero galvanizado formada por canales de 75 mm y montantes de 51x74x49 mm con una modulación de 600 mm entre ejes, dando un ancho total de tabique de 152 mm. Incluida parte proporcional del resto de materiales: tornillería, pasta de juntas, masilla para encuentros perimetrales, fijaciones, junta estanca, etc. Montaje según norma de instalación UNE 102043 y exigencias del CTE."]
[null,null,67490,"1.3.5","TABIQUE ATT® 164/600 (74)  [15+15+15+74+15+15+15]",600,74,{"$f":"3*15","v":45},"Tabique formado por tres placas BASIC de 15 mm de espesor compuestas por yeso natural, fibra de vidrio y aditivos inorgánicos que le aportan alta dureza y resistencia mecánica. Reacción al fuego: EUROCLASE A1. Sistema de galces desiguales: las placas encajan entre ellas dejando una entrecalle de 3 mm por donde se inserta la pasta de juntas. Este sistema no utiliza cinta de papel. La pasta de juntas se aplica en las cavidades de las placas y una masilla elástica en los encuentros. Atornillada a cada lado de una estructura metálica de acero galvanizado formada por canales de 75 mm y montantes de 51x74x49 mm con una modulación de 600 mm entre ejes, dando un ancho total de tabique de 164 mm. Incluida parte proporcional del resto de materiales: tornillería, pasta de juntas, masilla para encuentros perimetrales, fijaciones, junta estanca, etc. Montaje según norma de instalación UNE 102043 y exigencias del CTE.","Tabique formado por tres placas HIDRO de 15 mm de espesor compuestas por yeso natural, fibra de vidrio y aditivos inorgánicos que le aportan alta dureza y resistencia mecánica. Incorpora tratamiento hidrófugo, disminuyendo así su capacidad de absorción de agua (menor al 5%). Idónea para proteger las estancias de los efectos adversos de la humedad. Reacción al fuego: EUROCLASE A1. Sistema de galces desiguales: las placas encajan entre ellas dejando una entrecalle de 3 mm por donde se inserta la pasta de juntas. Este sistema no utiliza cinta de papel. La pasta de juntas se aplica en las cavidades de las placas y una masilla elástica en los encuentros. Atornillada a cada lado de una estructura metálica de acero galvanizado formada por canales de 75 mm y montantes de 51x74x49 mm con una modulación de 600 mm entre ejes, dando un ancho total de tabique de 164 mm. Incluida parte proporcional del resto de materiales: tornillería, pasta de juntas, masilla para encuentros perimetrales, fijaciones, junta estanca, etc. Montaje según norma de instalación UNE 102043 y exigencias del CTE.","Tabique formado por tres placas FUEGO de 15 mm de espesor compuestas por yeso natural, fibra de vidrio y aditivos inorgánicos que le aportan alta dureza y resistencia mecánica. Incorpora perlita y un aumento en la densidad que la hace idónea para un excelente comportamiento y resistencia frente al fuego. Reacción al fuego: EUROCLASE A1. Sistema de galces desiguales: las placas encajan entre ellas dejando una entrecalle de 3 mm por donde se inserta la pasta de juntas. Este sistema no utiliza cinta de papel. La pasta de juntas se aplica en las cavidades de las placas y una masilla elástica en los encuentros. Atornillada a cada lado de una estructura metálica de acero galvanizado formada por canales de 75 mm y montantes de 51x74x49 mm con una modulación de 600 mm entre ejes, dando un ancho total de tabique de 164 mm. Incluida parte proporcional del resto de materiales: tornillería, pasta de juntas, masilla para encuentros perimetrales, fijaciones, junta estanca, etc. Montaje según norma de instalación UNE 102043 y exigencias del CTE.","Tabique formado por tres placas RESIST de 15 mm de espesor compuestas por yeso natural, fibra de vidrio y aditivos inorgánicos que le aportan alta dureza y resistencia mecánica. Con mayor cantidad de fibra de vidrio y dosificación modificada, aumenta su densidad, mejorando notablemente la resistencia mecánica. Idónea para lugares con altas exigencias en cuanto a deterioro y desgaste. Reacción al fuego: EUROCLASE A1. Sistema de galces desiguales: las placas encajan entre ellas dejando una entrecalle de 3 mm por donde se inserta la pasta de juntas. Este sistema no utiliza cinta de papel. La pasta de juntas se aplica en las cavidades de las placas y una masilla elástica en los encuentros. Atornillada a cada lado de una estructura metálica de acero galvanizado formada por canales de 75 mm y montantes de 51x74x49 mm con una modulación de 600 mm entre ejes, dando un ancho total de tabique de 164 mm. Incluida parte proporcional del resto de materiales: tornillería, pasta de juntas, masilla para encuentros perimetrales, fijaciones, junta estanca, etc. Montaje según norma de instalación UNE 102043 y exigencias del CTE.","Tabique formado por tres placas HIDROPLUS de 15 mm de espesor compuestas por yeso natural, fibra de vidrio y aditivos inorgánicos que le aportan alta dureza y resistencia mecánica. Incorpora tratamiento hidrófugo y un aumento en su densidad, características claves para una elevada resistencia a la humedad (absorción de agua menor al 3%) y una gran resistencia mecánica. Idónea para zonas de intemperie. Reacción al fuego: EUROCLASE A1. Sistema de galces desiguales: las placas encajan entre ellas dejando una entrecalle de 3 mm por donde se inserta la pasta de juntas. Este sistema no utiliza cinta de papel. La pasta de juntas se aplica en las cavidades de las placas y una masilla elástica en los encuentros. Atornillada a cada lado de una estructura metálica de acero galvanizado formada por canales de 75 mm y montantes de 51x74x49 mm con una modulación de 600 mm entre ejes, dando un ancho total de tabique de 164 mm. Incluida parte proporcional del resto de materiales: tornillería, pasta de juntas, masilla para encuentros perimetrales, fijaciones, junta estanca, etc. Montaje según norma de instalación UNE 102043 y exigencias del CTE.","Tabique formado por tres placas SUPREM de 15 mm de espesor compuestas por yeso natural, fibra de vidrio y aditivos inorgánicos que le aportan alta dureza y resistencia mecánica. Incorpora tratamiento hidrófugo, perlita y un aumento en la densidad para conseguir soluciones constructivas que cumplan, altos requisitos frente al fuego y una capacidad reducida de absorción de agua. Reacción al fuego: EUROCLASE A1. Sistema de galces desiguales: las placas encajan entre ellas dejando una entrecalle de 3 mm por donde se inserta la pasta de juntas. Este sistema no utiliza cinta de papel. La pasta de juntas se aplica en las cavidades de las placas y una masilla elástica en los encuentros. Atornillada a cada lado de una estructura metálica de acero galvanizado formada por canales de 75 mm y montantes de 51x74x49 mm con una modulación de 600 mm entre ejes, dando un ancho total de tabique de 164 mm. Incluida parte proporcional del resto de materiales: tornillería, pasta de juntas, masilla para encuentros perimetrales, fijaciones, junta estanca, etc. Montaje según norma de instalación UNE 102043 y exigencias del CTE."]
[null,null,67520,"1.3.6","TABIQUE ATT® 194/600 (74)  [20+20+20+74+20+20+20]",600,74,{"$f":"3*20","v":60},"Tabique formado por tres placas BASIC de 20 mm de espesor compuestas por yeso natural, fibra de vidrio y aditivos inorgánicos que le aportan alta dureza y resistencia mecánica. Reacción al fuego: EUROCLASE A1. Sistema de galces desiguales: las placas encajan entre ellas dejando una entrecalle de 3 mm por donde se inserta la pasta de juntas. Este sistema no utiliza cinta de papel. La pasta de juntas se aplica en las cavidades de las placas y una masilla elástica en los encuentros. Atornillada a cada lado de una estructura metálica de acero galvanizado formada por canales de 75 mm y montantes de 51x74x49 mm con una modulación de 600 mm entre ejes, dando un ancho total de tabique de 194 mm. Incluida parte proporcional del resto de materiales: tornillería, pasta de juntas, masilla para encuentros perimetrales, fijaciones, junta estanca, etc. Montaje según norma de instalación UNE 102043 y exigencias del CTE.","Tabique formado por tres placas HIDRO de 20 mm de espesor compuestas por yeso natural, fibra de vidrio y aditivos inorgánicos que le aportan alta dureza y resistencia mecánica. Incorpora tratamiento hidrófugo, disminuyendo así su capacidad de absorción de agua (menor al 5%). Idónea para proteger las estancias de los efectos adversos de la humedad. Reacción al fuego: EUROCLASE A1. Sistema de galces desiguales: las placas encajan entre ellas dejando una entrecalle de 3 mm por donde se inserta la pasta de juntas. Este sistema no utiliza cinta de papel. La pasta de juntas se aplica en las cavidades de las placas y una masilla elástica en los encuentros. Atornillada a cada lado de una estructura metálica de acero galvanizado formada por canales de 75 mm y montantes de 51x74x49 mm con una modulación de 600 mm entre ejes, dando un ancho total de tabique de 194 mm. Incluida parte proporcional del resto de materiales: tornillería, pasta de juntas, masilla para encuentros perimetrales, fijaciones, junta estanca, etc. Montaje según norma de instalación UNE 102043 y exigencias del CTE.","Tabique formado por tres placas FUEGO de 20 mm de espesor compuestas por yeso natural, fibra de vidrio y aditivos inorgánicos que le aportan alta dureza y resistencia mecánica. Incorpora perlita y un aumento en la densidad que la hace idónea para un excelente comportamiento y resistencia frente al fuego. Reacción al fuego: EUROCLASE A1. Sistema de galces desiguales: las placas encajan entre ellas dejando una entrecalle de 3 mm por donde se inserta la pasta de juntas. Este sistema no utiliza cinta de papel. La pasta de juntas se aplica en las cavidades de las placas y una masilla elástica en los encuentros. Atornillada a cada lado de una estructura metálica de acero galvanizado formada por canales de 75 mm y montantes de 51x74x49 mm con una modulación de 600 mm entre ejes, dando un ancho total de tabique de 194 mm. Incluida parte proporcional del resto de materiales: tornillería, pasta de juntas, masilla para encuentros perimetrales, fijaciones, junta estanca, etc. Montaje según norma de instalación UNE 102043 y exigencias del CTE.","Tabique formado por tres placas RESIST de 20 mm de espesor compuestas por yeso natural, fibra de vidrio y aditivos inorgánicos que le aportan alta dureza y resistencia mecánica. Con mayor cantidad de fibra de vidrio y dosificación modificada, aumenta su densidad, mejorando notablemente la resistencia mecánica. Idónea para lugares con altas exigencias en cuanto a deterioro y desgaste. Reacción al fuego: EUROCLASE A1. Sistema de galces desiguales: las placas encajan entre ellas dejando una entrecalle de 3 mm por donde se inserta la pasta de juntas. Este sistema no utiliza cinta de papel. La pasta de juntas se aplica en las cavidades de las placas y una masilla elástica en los encuentros. Atornillada a cada lado de una estructura metálica de acero galvanizado formada por canales de 75 mm y montantes de 51x74x49 mm con una modulación de 600 mm entre ejes, dando un ancho total de tabique de 194 mm. Incluida parte proporcional del resto de materiales: tornillería, pasta de juntas, masilla para encuentros perimetrales, fijaciones, junta estanca, etc. Montaje según norma de instalación UNE 102043 y exigencias del CTE.","Tabique formado por tres placas HIDROPLUS de 20 mm de espesor compuestas por yeso natural, fibra de vidrio y aditivos inorgánicos que le aportan alta dureza y resistencia mecánica. Incorpora tratamiento hidrófugo y un aumento en su densidad, características claves para una elevada resistencia a la humedad (absorción de agua menor al 3%) y una gran resistencia mecánica. Idónea para zonas de intemperie. Reacción al fuego: EUROCLASE A1. Sistema de galces desiguales: las placas encajan entre ellas dejando una entrecalle de 3 mm por donde se inserta la pasta de juntas. Este sistema no utiliza cinta de papel. La pasta de juntas se aplica en las cavidades de las placas y una masilla elástica en los encuentros. Atornillada a cada lado de una estructura metálica de acero galvanizado formada por canales de 75 mm y montantes de 51x74x49 mm con una modulación de 600 mm entre ejes, dando un ancho total de tabique de 194 mm. Incluida parte proporcional del resto de materiales: tornillería, pasta de juntas, masilla para encuentros perimetrales, fijaciones, junta estanca, etc. Montaje según norma de instalación UNE 102043 y exigencias del CTE.","Tabique formado por tres placas SUPREM de 20 mm de espesor compuestas por yeso natural, fibra de vidrio y aditivos inorgánicos que le aportan alta dureza y resistencia mecánica. Incorpora tratamiento hidrófugo, perlita y un aumento en la densidad para conseguir soluciones constructivas que cumplan, altos requisitos frente al fuego y una capacidad reducida de absorción de agua. Reacción al fuego: EUROCLASE A1. Sistema de galces desiguales: las placas encajan entre ellas dejando una entrecalle de 3 mm por donde se inserta la pasta de juntas. Este sistema no utiliza cinta de papel. La pasta de juntas se aplica en las cavidades de las placas y una masilla elástica en los encuentros. Atornillada a cada lado de una estructura metálica de acero galvanizado formada por canales de 75 mm y montantes de 51x74x49 mm con una modulación de 600 mm entre ejes, dando un ancho total de tabique de 194 mm. Incluida parte proporcional del resto de materiales: tornillería, pasta de juntas, masilla para encuentros perimetrales, fijaciones, junta estanca, etc. Montaje según norma de instalación UNE 102043 y exigencias del CTE."]
[null,null,69978,"1.3.7","TABIQUE ATT® 177/600 (99)  [13+13+13+99+13+13+13]",600,99,{"$f":"3*13","v":39},"Tabique formado por tres placas BASIC de 13 mm de espesor compuestas por yeso natural, fibra de vidrio y aditivos inorgánicos que le aportan alta dureza y resistencia mecánica. Reacción al fuego: EUROCLASE A1. Sistema de galces desiguales: las placas encajan entre ellas dejando una entrecalle de 3 mm por donde se inserta la pasta de juntas. Este sistema no utiliza cinta de papel. La pasta de juntas se aplica en las cavidades de las placas y una masilla elástica en los encuentros. Atornillada a cada lado de una estructura metálica de acero galvanizado formada por canales de 100 mm y montantes de 51x99x49 mm con una modulación de 600 mm entre ejes, dando un ancho total de tabique de 177 mm. Incluida parte proporcional del resto de materiales: tornillería, pasta de juntas, masilla para encuentros perimetrales, fijaciones, junta estanca, etc. Montaje según norma de instalación UNE 102043 y exigencias del CTE.","Tabique formado por tres placas HIDRO de 13 mm de espesor compuestas por yeso natural, fibra de vidrio y aditivos inorgánicos que le aportan alta dureza y resistencia mecánica. Incorpora tratamiento hidrófugo, disminuyendo así su capacidad de absorción de agua (menor al 5%). Idónea para proteger las estancias de los efectos adversos de la humedad. Reacción al fuego: EUROCLASE A1. Sistema de galces desiguales: las placas encajan entre ellas dejando una entrecalle de 3 mm por donde se inserta la pasta de juntas. Este sistema no utiliza cinta de papel. La pasta de juntas se aplica en las cavidades de las placas y una masilla elástica en los encuentros. Atornillada a cada lado de una estructura metálica de acero galvanizado formada por canales de 100 mm y montantes de 51x99x49 mm con una modulación de 600 mm entre ejes, dando un ancho total de tabique de 177 mm. Incluida parte proporcional del resto de materiales: tornillería, pasta de juntas, masilla para encuentros perimetrales, fijaciones, junta estanca, etc. Montaje según norma de instalación UNE 102043 y exigencias del CTE.","Tabique formado por tres placas FUEGO de 13 mm de espesor compuestas por yeso natural, fibra de vidrio y aditivos inorgánicos que le aportan alta dureza y resistencia mecánica. Incorpora perlita y un aumento en la densidad que la hace idónea para un excelente comportamiento y resistencia frente al fuego. Reacción al fuego: EUROCLASE A1. Sistema de galces desiguales: las placas encajan entre ellas dejando una entrecalle de 3 mm por donde se inserta la pasta de juntas. Este sistema no utiliza cinta de papel. La pasta de juntas se aplica en las cavidades de las placas y una masilla elástica en los encuentros. Atornillada a cada lado de una estructura metálica de acero galvanizado formada por canales de 100 mm y montantes de 51x99x49 mm con una modulación de 600 mm entre ejes, dando un ancho total de tabique de 177 mm. Incluida parte proporcional del resto de materiales: tornillería, pasta de juntas, masilla para encuentros perimetrales, fijaciones, junta estanca, etc. Montaje según norma de instalación UNE 102043 y exigencias del CTE.","Tabique formado por tres placas RESIST de 13 mm de espesor compuestas por yeso natural, fibra de vidrio y aditivos inorgánicos que le aportan alta dureza y resistencia mecánica. Con mayor cantidad de fibra de vidrio y dosificación modificada, aumenta su densidad, mejorando notablemente la resistencia mecánica. Idónea para lugares con altas exigencias en cuanto a deterioro y desgaste. Reacción al fuego: EUROCLASE A1. Sistema de galces desiguales: las placas encajan entre ellas dejando una entrecalle de 3 mm por donde se inserta la pasta de juntas. Este sistema no utiliza cinta de papel. La pasta de juntas se aplica en las cavidades de las placas y una masilla elástica en los encuentros. Atornillada a cada lado de una estructura metálica de acero galvanizado formada por canales de 100 mm y montantes de 51x99x49 mm con una modulación de 600 mm entre ejes, dando un ancho total de tabique de 177 mm. Incluida parte proporcional del resto de materiales: tornillería, pasta de juntas, masilla para encuentros perimetrales, fijaciones, junta estanca, etc. Montaje según norma de instalación UNE 102043 y exigencias del CTE.","Tabique formado por tres placas HIDROPLUS de 13 mm de espesor compuestas por yeso natural, fibra de vidrio y aditivos inorgánicos que le aportan alta dureza y resistencia mecánica. Incorpora tratamiento hidrófugo y un aumento en su densidad, características claves para una elevada resistencia a la humedad (absorción de agua menor al 3%) y una gran resistencia mecánica. Idónea para zonas de intemperie. Reacción al fuego: EUROCLASE A1. Sistema de galces desiguales: las placas encajan entre ellas dejando una entrecalle de 3 mm por donde se inserta la pasta de juntas. Este sistema no utiliza cinta de papel. La pasta de juntas se aplica en las cavidades de las placas y una masilla elástica en los encuentros. Atornillada a cada lado de una estructura metálica de acero galvanizado formada por canales de 100 mm y montantes de 51x99x49 mm con una modulación de 600 mm entre ejes, dando un ancho total de tabique de 177 mm. Incluida parte proporcional del resto de materiales: tornillería, pasta de juntas, masilla para encuentros perimetrales, fijaciones, junta estanca, etc. Montaje según norma de instalación UNE 102043 y exigencias del CTE.","Tabique formado por tres placas SUPREM de 13 mm de espesor compuestas por yeso natural, fibra de vidrio y aditivos inorgánicos que le aportan alta dureza y resistencia mecánica. Incorpora tratamiento hidrófugo, perlita y un aumento en la densidad para conseguir soluciones constructivas que cumplan, altos requisitos frente al fuego y una capacidad reducida de absorción de agua. Reacción al fuego: EUROCLASE A1. Sistema de galces desiguales: las placas encajan entre ellas dejando una entrecalle de 3 mm por donde se inserta la pasta de juntas. Este sistema no utiliza cinta de papel. La pasta de juntas se aplica en las cavidades de las placas y una masilla elástica en los encuentros. Atornillada a cada lado de una estructura metálica de acero galvanizado formada por canales de 100 mm y montantes de 51x99x49 mm con una modulación de 600 mm entre ejes, dando un ancho total de tabique de 177 mm. Incluida parte proporcional del resto de materiales: tornillería, pasta de juntas, masilla para encuentros perimetrales, fijaciones, junta estanca, etc. Montaje según norma de instalación UNE 102043 y exigencias del CTE."]
[null,null,69990,"1.3.8","TABIQUE ATT® 189/600 (99)  [15+15+15+99+15+15+15]",600,99,{"$f":"3*15","v":45},"Tabique formado por tres placas BASIC de 15 mm de espesor compuestas por yeso natural, fibra de vidrio y aditivos inorgánicos que le aportan alta dureza y resistencia mecánica. Reacción al fuego: EUROCLASE A1. Sistema de galces desiguales: las placas encajan entre ellas dejando una entrecalle de 3 mm por donde se inserta la pasta de juntas. Este sistema no utiliza cinta de papel. La pasta de juntas se aplica en las cavidades de las placas y una masilla elástica en los encuentros. Atornillada a cada lado de una estructura metálica de acero galvanizado formada por canales de 100 mm y montantes de 51x99x49 mm con una modulación de 600 mm entre ejes, dando un ancho total de tabique de 189 mm. Incluida parte proporcional del resto de materiales: tornillería, pasta de juntas, masilla para encuentros perimetrales, fijaciones, junta estanca, etc. Montaje según norma de instalación UNE 102043 y exigencias del CTE.","Tabique formado por tres placas HIDRO de 15 mm de espesor compuestas por yeso natural, fibra de vidrio y aditivos inorgánicos que le aportan alta dureza y resistencia mecánica. Incorpora tratamiento hidrófugo, disminuyendo así su capacidad de absorción de agua (menor al 5%). Idónea para proteger las estancias de los efectos adversos de la humedad. Reacción al fuego: EUROCLASE A1. Sistema de galces desiguales: las placas encajan entre ellas dejando una entrecalle de 3 mm por donde se inserta la pasta de juntas. Este sistema no utiliza cinta de papel. La pasta de juntas se aplica en las cavidades de las placas y una masilla elástica en los encuentros. Atornillada a cada lado de una estructura metálica de acero galvanizado formada por canales de 100 mm y montantes de 51x99x49 mm con una modulación de 600 mm entre ejes, dando un ancho total de tabique de 189 mm. Incluida parte proporcional del resto de materiales: tornillería, pasta de juntas, masilla para encuentros perimetrales, fijaciones, junta estanca, etc. Montaje según norma de instalación UNE 102043 y exigencias del CTE.","Tabique formado por tres placas FUEGO de 15 mm de espesor compuestas por yeso natural, fibra de vidrio y aditivos inorgánicos que le aportan alta dureza y resistencia mecánica. Incorpora perlita y un aumento en la densidad que la hace idónea para un excelente comportamiento y resistencia frente al fuego. Reacción al fuego: EUROCLASE A1. Sistema de galces desiguales: las placas encajan entre ellas dejando una entrecalle de 3 mm por donde se inserta la pasta de juntas. Este sistema no utiliza cinta de papel. La pasta de juntas se aplica en las cavidades de las placas y una masilla elástica en los encuentros. Atornillada a cada lado de una estructura metálica de acero galvanizado formada por canales de 100 mm y montantes de 51x99x49 mm con una modulación de 600 mm entre ejes, dando un ancho total de tabique de 189 mm. Incluida parte proporcional del resto de materiales: tornillería, pasta de juntas, masilla para encuentros perimetrales, fijaciones, junta estanca, etc. Montaje según norma de instalación UNE 102043 y exigencias del CTE.","Tabique formado por tres placas RESIST de 15 mm de espesor compuestas por yeso natural, fibra de vidrio y aditivos inorgánicos que le aportan alta dureza y resistencia mecánica. Con mayor cantidad de fibra de vidrio y dosificación modificada, aumenta su densidad, mejorando notablemente la resistencia mecánica. Idónea para lugares con altas exigencias en cuanto a deterioro y desgaste. Reacción al fuego: EUROCLASE A1. Sistema de galces desiguales: las placas encajan entre ellas dejando una entrecalle de 3 mm por donde se inserta la pasta de juntas. Este sistema no utiliza cinta de papel. La pasta de juntas se aplica en las cavidades de las placas y una masilla elástica en los encuentros. Atornillada a cada lado de una estructura metálica de acero galvanizado formada por canales de 100 mm y montantes de 51x99x49 mm con una modulación de 600 mm entre ejes, dando un ancho total de tabique de 189 mm. Incluida parte proporcional del resto de materiales: tornillería, pasta de juntas, masilla para encuentros perimetrales, fijaciones, junta estanca, etc. Montaje según norma de instalación UNE 102043 y exigencias del CTE.","Tabique formado por tres placas HIDROPLUS de 15 mm de espesor compuestas por yeso natural, fibra de vidrio y aditivos inorgánicos que le aportan alta dureza y resistencia mecánica. Incorpora tratamiento hidrófugo y un aumento en su densidad, características claves para una elevada resistencia a la humedad (absorción de agua menor al 3%) y una gran resistencia mecánica. Idónea para zonas de intemperie. Reacción al fuego: EUROCLASE A1. Sistema de galces desiguales: las placas encajan entre ellas dejando una entrecalle de 3 mm por donde se inserta la pasta de juntas. Este sistema no utiliza cinta de papel. La pasta de juntas se aplica en las cavidades de las placas y una masilla elástica en los encuentros. Atornillada a cada lado de una estructura metálica de acero galvanizado formada por canales de 100 mm y montantes de 51x99x49 mm con una modulación de 600 mm entre ejes, dando un ancho total de tabique de 189 mm. Incluida parte proporcional del resto de materiales: tornillería, pasta de juntas, masilla para encuentros perimetrales, fijaciones, junta estanca, etc. Montaje según norma de instalación UNE 102043 y exigencias del CTE.","Tabique formado por tres placas SUPREM de 15 mm de espesor compuestas por yeso natural, fibra de vidrio y aditivos inorgánicos que le aportan alta dureza y resistencia mecánica. Incorpora tratamiento hidrófugo, perlita y un aumento en la densidad para conseguir soluciones constructivas que cumplan, altos requisitos frente al fuego y una capacidad reducida de absorción de agua. Reacción al fuego: EUROCLASE A1. Sistema de galces desiguales: las placas encajan entre ellas dejando una entrecalle de 3 mm por donde se inserta la pasta de juntas. Este sistema no utiliza cinta de papel. La pasta de juntas se aplica en las cavidades de las placas y una masilla elástica en los encuentros. Atornillada a cada lado de una estructura metálica de acero galvanizado formada por canales de 100 mm y montantes de 51x99x49 mm con una modulación de 600 mm entre ejes, dando un ancho total de tabique de 189 mm. Incluida parte proporcional del resto de materiales: tornillería, pasta de juntas, masilla para encuentros perimetrales, fijaciones, junta estanca, etc. Montaje según norma de instalación UNE 102043 y exigencias del CTE."]
[null,null,70020,"1.3.9","TABIQUE ATT® 219/600 (99)  [20+20+20+99+20+20+20]",600,99,{"$f":"3*20","v":60},"Tabique formado por tres placas BASIC de 20 mm de espesor compuestas por yeso natural, fibra de vidrio y aditivos inorgánicos que le aportan alta dureza y resistencia mecánica. Reacción al fuego: EUROCLASE A1. Sistema de galces desiguales: las placas encajan entre ellas dejando una entrecalle de 3 mm por donde se inserta la pasta de juntas. Este sistema no utiliza cinta de papel. La pasta de juntas se aplica en las cavidades de las placas y una masilla elástica en los encuentros. Atornillada a cada lado de una estructura metálica de acero galvanizado formada por canales de 100 mm y montantes de 51x99x49 mm con una modulación de 600 mm entre ejes, dando un ancho total de tabique de 219 mm. Incluida parte proporcional del resto de materiales: tornillería, pasta de juntas, masilla para encuentros perimetrales, fijaciones, junta estanca, etc. Montaje según norma de instalación UNE 102043 y exigencias del CTE.","Tabique formado por tres placas HIDRO de 20 mm de espesor compuestas por yeso natural, fibra de vidrio y aditivos inorgánicos que le aportan alta dureza y resistencia mecánica. Incorpora tratamiento hidrófugo, disminuyendo así su capacidad de absorción de agua (menor al 5%). Idónea para proteger las estancias de los efectos adversos de la humedad. Reacción al fuego: EUROCLASE A1. Sistema de galces desiguales: las placas encajan entre ellas dejando una entrecalle de 3 mm por donde se inserta la pasta de juntas. Este sistema no utiliza cinta de papel. La pasta de juntas se aplica en las cavidades de las placas y una masilla elástica en los encuentros. Atornillada a cada lado de una estructura metálica de acero galvanizado formada por canales de 100 mm y montantes de 51x99x49 mm con una modulación de 600 mm entre ejes, dando un ancho total de tabique de 219 mm. Incluida parte proporcional del resto de materiales: tornillería, pasta de juntas, masilla para encuentros perimetrales, fijaciones, junta estanca, etc. Montaje según norma de instalación UNE 102043 y exigencias del CTE.","Tabique formado por tres placas FUEGO de 20 mm de espesor compuestas por yeso natural, fibra de vidrio y aditivos inorgánicos que le aportan alta dureza y resistencia mecánica. Incorpora perlita y un aumento en la densidad que la hace idónea para un excelente comportamiento y resistencia frente al fuego. Reacción al fuego: EUROCLASE A1. Sistema de galces desiguales: las placas encajan entre ellas dejando una entrecalle de 3 mm por donde se inserta la pasta de juntas. Este sistema no utiliza cinta de papel. La pasta de juntas se aplica en las cavidades de las placas y una masilla elástica en los encuentros. Atornillada a cada lado de una estructura metálica de acero galvanizado formada por canales de 100 mm y montantes de 51x99x49 mm con una modulación de 600 mm entre ejes, dando un ancho total de tabique de 219 mm. Incluida parte proporcional del resto de materiales: tornillería, pasta de juntas, masilla para encuentros perimetrales, fijaciones, junta estanca, etc. Montaje según norma de instalación UNE 102043 y exigencias del CTE.","Tabique formado por tres placas RESIST de 20 mm de espesor compuestas por yeso natural, fibra de vidrio y aditivos inorgánicos que le aportan alta dureza y resistencia mecánica. Con mayor cantidad de fibra de vidrio y dosificación modificada, aumenta su densidad, mejorando notablemente la resistencia mecánica. Idónea para lugares con altas exigencias en cuanto a deterioro y desgaste. Reacción al fuego: EUROCLASE A1. Sistema de galces desiguales: las placas encajan entre ellas dejando una entrecalle de 3 mm por donde se inserta la pasta de juntas. Este sistema no utiliza cinta de papel. La pasta de juntas se aplica en las cavidades de las placas y una masilla elástica en los encuentros. Atornillada a cada lado de una estructura metálica de acero galvanizado formada por canales de 100 mm y montantes de 51x99x49 mm con una modulación de 600 mm entre ejes, dando un ancho total de tabique de 219 mm. Incluida parte proporcional del resto de materiales: tornillería, pasta de juntas, masilla para encuentros perimetrales, fijaciones, junta estanca, etc. Montaje según norma de instalación UNE 102043 y exigencias del CTE.","Tabique formado por tres placas HIDROPLUS de 20 mm de espesor compuestas por yeso natural, fibra de vidrio y aditivos inorgánicos que le aportan alta dureza y resistencia mecánica. Incorpora tratamiento hidrófugo y un aumento en su densidad, características claves para una elevada resistencia a la humedad (absorción de agua menor al 3%) y una gran resistencia mecánica. Idónea para zonas de intemperie. Reacción al fuego: EUROCLASE A1. Sistema de galces desiguales: las placas encajan entre ellas dejando una entrecalle de 3 mm por donde se inserta la pasta de juntas. Este sistema no utiliza cinta de papel. La pasta de juntas se aplica en las cavidades de las placas y una masilla elástica en los encuentros. Atornillada a cada lado de una estructura metálica de acero galvanizado formada por canales de 100 mm y montantes de 51x99x49 mm con una modulación de 600 mm entre ejes, dando un ancho total de tabique de 219 mm. Incluida parte proporcional del resto de materiales: tornillería, pasta de juntas, masilla para encuentros perimetrales, fijaciones, junta estanca, etc. Montaje según norma de instalación UNE 102043 y exigencias del CTE.","Tabique formado por tres placas SUPREM de 20 mm de espesor compuestas por yeso natural, fibra de vidrio y aditivos inorgánicos que le aportan alta dureza y resistencia mecánica. Incorpora tratamiento hidrófugo, perlita y un aumento en la densidad para conseguir soluciones constructivas que cumplan, altos requisitos frente al fuego y una capacidad reducida de absorción de agua. Reacción al fuego: EUROCLASE A1. Sistema de galces desiguales: las placas encajan entre ellas dejando una entrecalle de 3 mm por donde se inserta la pasta de juntas. Este sistema no utiliza cinta de papel. La pasta de juntas se aplica en las cavidades de las placas y una masilla elástica en los encuentros. Atornillada a cada lado de una estructura metálica de acero galvanizado formada por canales de 100 mm y montantes de 51x99x49 mm con una modulación de 600 mm entre ejes, dando un ancho total de tabique de 219 mm. Incluida parte proporcional del resto de materiales: tornillería, pasta de juntas, masilla para encuentros perimetrales, fijaciones, junta estanca, etc. Montaje según norma de instalación UNE 102043 y exigencias del CTE."]
[null,null,44978,"1.3.10","TABIQUE ATT® 127/400 (49)  [13+13+13+49+13+13+13]",400,49,{"$f":"3*13","v":39},"Tabique formado por tres placas BASIC de 13 mm de espesor compuestas por yeso natural, fibra de vidrio y aditivos inorgánicos que le aportan alta dureza y resistencia mecánica. Reacción al fuego: EUROCLASE A1. Sistema de galces desiguales: las placas encajan entre ellas dejando una entrecalle de 3 mm por donde se inserta la pasta de juntas. Este sistema no utiliza cinta de papel. La pasta de juntas se aplica en las cavidades de las placas y una masilla elástica en los encuentros. Atornillada a cada lado de una estructura metálica de acero galvanizado formada por canales de 50 mm y montantes de 51x49x49 mm con una modulación de 400 mm entre ejes, dando un ancho total de tabique de 127 mm. Incluida parte proporcional del resto de materiales: tornillería, pasta de juntas, masilla para encuentros perimetrales, fijaciones, junta estanca, etc. Montaje según norma de instalación UNE 102043 y exigencias del CTE.","Tabique formado por tres placas HIDRO de 13 mm de espesor compuestas por yeso natural, fibra de vidrio y aditivos inorgánicos que le aportan alta dureza y resistencia mecánica. Incorpora tratamiento hidrófugo, disminuyendo así su capacidad de absorción de agua (menor al 5%). Idónea para proteger las estancias de los efectos adversos de la humedad. Reacción al fuego: EUROCLASE A1. Sistema de galces desiguales: las placas encajan entre ellas dejando una entrecalle de 3 mm por donde se inserta la pasta de juntas. Este sistema no utiliza cinta de papel. La pasta de juntas se aplica en las cavidades de las placas y una masilla elástica en los encuentros. Atornillada a cada lado de una estructura metálica de acero galvanizado formada por canales de 50 mm y montantes de 51x49x49 mm con una modulación de 400 mm entre ejes, dando un ancho total de tabique de 127 mm. Incluida parte proporcional del resto de materiales: tornillería, pasta de juntas, masilla para encuentros perimetrales, fijaciones, junta estanca, etc. Montaje según norma de instalación UNE 102043 y exigencias del CTE.","Tabique formado por tres placas FUEGO de 13 mm de espesor compuestas por yeso natural, fibra de vidrio y aditivos inorgánicos que le aportan alta dureza y resistencia mecánica. Incorpora perlita y un aumento en la densidad que la hace idónea para un excelente comportamiento y resistencia frente al fuego. Reacción al fuego: EUROCLASE A1. Sistema de galces desiguales: las placas encajan entre ellas dejando una entrecalle de 3 mm por donde se inserta la pasta de juntas. Este sistema no utiliza cinta de papel. La pasta de juntas se aplica en las cavidades de las placas y una masilla elástica en los encuentros. Atornillada a cada lado de una estructura metálica de acero galvanizado formada por canales de 50 mm y montantes de 51x49x49 mm con una modulación de 400 mm entre ejes, dando un ancho total de tabique de 127 mm. Incluida parte proporcional del resto de materiales: tornillería, pasta de juntas, masilla para encuentros perimetrales, fijaciones, junta estanca, etc. Montaje según norma de instalación UNE 102043 y exigencias del CTE.","Tabique formado por tres placas RESIST de 13 mm de espesor compuestas por yeso natural, fibra de vidrio y aditivos inorgánicos que le aportan alta dureza y resistencia mecánica. Con mayor cantidad de fibra de vidrio y dosificación modificada, aumenta su densidad, mejorando notablemente la resistencia mecánica. Idónea para lugares con altas exigencias en cuanto a deterioro y desgaste. Reacción al fuego: EUROCLASE A1. Sistema de galces desiguales: las placas encajan entre ellas dejando una entrecalle de 3 mm por donde se inserta la pasta de juntas. Este sistema no utiliza cinta de papel. La pasta de juntas se aplica en las cavidades de las placas y una masilla elástica en los encuentros. Atornillada a cada lado de una estructura metálica de acero galvanizado formada por canales de 50 mm y montantes de 51x49x49 mm con una modulación de 400 mm entre ejes, dando un ancho total de tabique de 127 mm. Incluida parte proporcional del resto de materiales: tornillería, pasta de juntas, masilla para encuentros perimetrales, fijaciones, junta estanca, etc. Montaje según norma de instalación UNE 102043 y exigencias del CTE.","Tabique formado por tres placas HIDROPLUS de 13 mm de espesor compuestas por yeso natural, fibra de vidrio y aditivos inorgánicos que le aportan alta dureza y resistencia mecánica. Incorpora tratamiento hidrófugo y un aumento en su densidad, características claves para una elevada resistencia a la humedad (absorción de agua menor al 3%) y una gran resistencia mecánica. Idónea para zonas de intemperie. Reacción al fuego: EUROCLASE A1. Sistema de galces desiguales: las placas encajan entre ellas dejando una entrecalle de 3 mm por donde se inserta la pasta de juntas. Este sistema no utiliza cinta de papel. La pasta de juntas se aplica en las cavidades de las placas y una masilla elástica en los encuentros. Atornillada a cada lado de una estructura metálica de acero galvanizado formada por canales de 50 mm y montantes de 51x49x49 mm con una modulación de 400 mm entre ejes, dando un ancho total de tabique de 127 mm. Incluida parte proporcional del resto de materiales: tornillería, pasta de juntas, masilla para encuentros perimetrales, fijaciones, junta estanca, etc. Montaje según norma de instalación UNE 102043 y exigencias del CTE.","Tabique formado por tres placas SUPREM de 13 mm de espesor compuestas por yeso natural, fibra de vidrio y aditivos inorgánicos que le aportan alta dureza y resistencia mecánica. Incorpora tratamiento hidrófugo, perlita y un aumento en la densidad para conseguir soluciones constructivas que cumplan, altos requisitos frente al fuego y una capacidad reducida de absorción de agua. Reacción al fuego: EUROCLASE A1. Sistema de galces desiguales: las placas encajan entre ellas dejando una entrecalle de 3 mm por donde se inserta la pasta de juntas. Este sistema no utiliza cinta de papel. La pasta de juntas se aplica en las cavidades de las placas y una masilla elástica en los encuentros. Atornillada a cada lado de una estructura metálica de acero galvanizado formada por canales de 50 mm y montantes de 51x49x49 mm con una modulación de 400 mm entre ejes, dando un ancho total de tabique de 127 mm. Incluida parte proporcional del resto de materiales: tornillería, pasta de juntas, masilla para encuentros perimetrales, fijaciones, junta estanca, etc. Montaje según norma de instalación UNE 102043 y exigencias del CTE."]
[null,null,44990,"1.3.11","TABIQUE ATT® 139/400 (49)  [15+15+15+49+15+15+15]",400,49,{"$f":"3*15","v":45},"Tabique formado por tres placas BASIC de 15 mm de espesor compuestas por yeso natural, fibra de vidrio y aditivos inorgánicos que le aportan alta dureza y resistencia mecánica. Reacción al fuego: EUROCLASE A1. Sistema de galces desiguales: las placas encajan entre ellas dejando una entrecalle de 3 mm por donde se inserta la pasta de juntas. Este sistema no utiliza cinta de papel. La pasta de juntas se aplica en las cavidades de las placas y una masilla elástica en los encuentros. Atornillada a cada lado de una estructura metálica de acero galvanizado formada por canales de 50 mm y montantes de 51x49x49 mm con una modulación de 400 mm entre ejes, dando un ancho total de tabique de 139 mm. Incluida parte proporcional del resto de materiales: tornillería, pasta de juntas, masilla para encuentros perimetrales, fijaciones, junta estanca, etc. Montaje según norma de instalación UNE 102043 y exigencias del CTE.","Tabique formado por tres placas HIDRO de 15 mm de espesor compuestas por yeso natural, fibra de vidrio y aditivos inorgánicos que le aportan alta dureza y resistencia mecánica. Incorpora tratamiento hidrófugo, disminuyendo así su capacidad de absorción de agua (menor al 5%). Idónea para proteger las estancias de los efectos adversos de la humedad. Reacción al fuego: EUROCLASE A1. Sistema de galces desiguales: las placas encajan entre ellas dejando una entrecalle de 3 mm por donde se inserta la pasta de juntas. Este sistema no utiliza cinta de papel. La pasta de juntas se aplica en las cavidades de las placas y una masilla elástica en los encuentros. Atornillada a cada lado de una estructura metálica de acero galvanizado formada por canales de 50 mm y montantes de 51x49x49 mm con una modulación de 400 mm entre ejes, dando un ancho total de tabique de 139 mm. Incluida parte proporcional del resto de materiales: tornillería, pasta de juntas, masilla para encuentros perimetrales, fijaciones, junta estanca, etc. Montaje según norma de instalación UNE 102043 y exigencias del CTE.","Tabique formado por tres placas FUEGO de 15 mm de espesor compuestas por yeso natural, fibra de vidrio y aditivos inorgánicos que le aportan alta dureza y resistencia mecánica. Incorpora perlita y un aumento en la densidad que la hace idónea para un excelente comportamiento y resistencia frente al fuego. Reacción al fuego: EUROCLASE A1. Sistema de galces desiguales: las placas encajan entre ellas dejando una entrecalle de 3 mm por donde se inserta la pasta de juntas. Este sistema no utiliza cinta de papel. La pasta de juntas se aplica en las cavidades de las placas y una masilla elástica en los encuentros. Atornillada a cada lado de una estructura metálica de acero galvanizado formada por canales de 50 mm y montantes de 51x49x49 mm con una modulación de 400 mm entre ejes, dando un ancho total de tabique de 139 mm. Incluida parte proporcional del resto de materiales: tornillería, pasta de juntas, masilla para encuentros perimetrales, fijaciones, junta estanca, etc. Montaje según norma de instalación UNE 102043 y exigencias del CTE.","Tabique formado por tres placas RESIST de 15 mm de espesor compuestas por yeso natural, fibra de vidrio y aditivos inorgánicos que le aportan alta dureza y resistencia mecánica. Con mayor cantidad de fibra de vidrio y dosificación modificada, aumenta su densidad, mejorando notablemente la resistencia mecánica. Idónea para lugares con altas exigencias en cuanto a deterioro y desgaste. Reacción al fuego: EUROCLASE A1. Sistema de galces desiguales: las placas encajan entre ellas dejando una entrecalle de 3 mm por donde se inserta la pasta de juntas. Este sistema no utiliza cinta de papel. La pasta de juntas se aplica en las cavidades de las placas y una masilla elástica en los encuentros. Atornillada a cada lado de una estructura metálica de acero galvanizado formada por canales de 50 mm y montantes de 51x49x49 mm con una modulación de 400 mm entre ejes, dando un ancho total de tabique de 139 mm. Incluida parte proporcional del resto de materiales: tornillería, pasta de juntas, masilla para encuentros perimetrales, fijaciones, junta estanca, etc. Montaje según norma de instalación UNE 102043 y exigencias del CTE.","Tabique formado por tres placas HIDROPLUS de 15 mm de espesor compuestas por yeso natural, fibra de vidrio y aditivos inorgánicos que le aportan alta dureza y resistencia mecánica. Incorpora tratamiento hidrófugo y un aumento en su densidad, características claves para una elevada resistencia a la humedad (absorción de agua menor al 3%) y una gran resistencia mecánica. Idónea para zonas de intemperie. Reacción al fuego: EUROCLASE A1. Sistema de galces desiguales: las placas encajan entre ellas dejando una entrecalle de 3 mm por donde se inserta la pasta de juntas. Este sistema no utiliza cinta de papel. La pasta de juntas se aplica en las cavidades de las placas y una masilla elástica en los encuentros. Atornillada a cada lado de una estructura metálica de acero galvanizado formada por canales de 50 mm y montantes de 51x49x49 mm con una modulación de 400 mm entre ejes, dando un ancho total de tabique de 139 mm. Incluida parte proporcional del resto de materiales: tornillería, pasta de juntas, masilla para encuentros perimetrales, fijaciones, junta estanca, etc. Montaje según norma de instalación UNE 102043 y exigencias del CTE.","Tabique formado por tres placas SUPREM de 15 mm de espesor compuestas por yeso natural, fibra de vidrio y aditivos inorgánicos que le aportan alta dureza y resistencia mecánica. Incorpora tratamiento hidrófugo, perlita y un aumento en la densidad para conseguir soluciones constructivas que cumplan, altos requisitos frente al fuego y una capacidad reducida de absorción de agua. Reacción al fuego: EUROCLASE A1. Sistema de galces desiguales: las placas encajan entre ellas dejando una entrecalle de 3 mm por donde se inserta la pasta de juntas. Este sistema no utiliza cinta de papel. La pasta de juntas se aplica en las cavidades de las placas y una masilla elástica en los encuentros. Atornillada a cada lado de una estructura metálica de acero galvanizado formada por canales de 50 mm y montantes de 51x49x49 mm con una modulación de 400 mm entre ejes, dando un ancho total de tabique de 139 mm. Incluida parte proporcional del resto de materiales: tornillería, pasta de juntas, masilla para encuentros perimetrales, fijaciones, junta estanca, etc. Montaje según norma de instalación UNE 102043 y exigencias del CTE."]
[null,null,45020,"1.3.12","TABIQUE ATT® 169/400 (49)  [20+20+20+49+20+20+20]",400,49,{"$f":"3*20","v":60},"Tabique formado por tres placas BASIC de 20 mm de espesor compuestas por yeso natural, fibra de vidrio y aditivos inorgánicos que le aportan alta dureza y resistencia mecánica. Reacción al fuego: EUROCLASE A1. Sistema de galces desiguales: las placas encajan entre ellas dejando una entrecalle de 3 mm por donde se inserta la pasta de juntas. Este sistema no utiliza cinta de papel. La pasta de juntas se aplica en las cavidades de las placas y una masilla elástica en los encuentros. Atornillada a cada lado de una estructura metálica de acero galvanizado formada por canales de 50 mm y montantes de 51x49x49 mm con una modulación de 400 mm entre ejes, dando un ancho total de tabique de 169 mm. Incluida parte proporcional del resto de materiales: tornillería, pasta de juntas, masilla para encuentros perimetrales, fijaciones, junta estanca, etc. Montaje según norma de instalación UNE 102043 y exigencias del CTE.","Tabique formado por tres placas HIDRO de 20 mm de espesor compuestas por yeso natural, fibra de vidrio y aditivos inorgánicos que le aportan alta dureza y resistencia mecánica. Incorpora tratamiento hidrófugo, disminuyendo así su capacidad de absorción de agua (menor al 5%). Idónea para proteger las estancias de los efectos adversos de la humedad. Reacción al fuego: EUROCLASE A1. Sistema de galces desiguales: las placas encajan entre ellas dejando una entrecalle de 3 mm por donde se inserta la pasta de juntas. Este sistema no utiliza cinta de papel. La pasta de juntas se aplica en las cavidades de las placas y una masilla elástica en los encuentros. Atornillada a cada lado de una estructura metálica de acero galvanizado formada por canales de 50 mm y montantes de 51x49x49 mm con una modulación de 400 mm entre ejes, dando un ancho total de tabique de 169 mm. Incluida parte proporcional del resto de materiales: tornillería, pasta de juntas, masilla para encuentros perimetrales, fijaciones, junta estanca, etc. Montaje según norma de instalación UNE 102043 y exigencias del CTE.","Tabique formado por tres placas FUEGO de 20 mm de espesor compuestas por yeso natural, fibra de vidrio y aditivos inorgánicos que le aportan alta dureza y resistencia mecánica. Incorpora perlita y un aumento en la densidad que la hace idónea para un excelente comportamiento y resistencia frente al fuego. Reacción al fuego: EUROCLASE A1. Sistema de galces desiguales: las placas encajan entre ellas dejando una entrecalle de 3 mm por donde se inserta la pasta de juntas. Este sistema no utiliza cinta de papel. La pasta de juntas se aplica en las cavidades de las placas y una masilla elástica en los encuentros. Atornillada a cada lado de una estructura metálica de acero galvanizado formada por canales de 50 mm y montantes de 51x49x49 mm con una modulación de 400 mm entre ejes, dando un ancho total de tabique de 169 mm. Incluida parte proporcional del resto de materiales: tornillería, pasta de juntas, masilla para encuentros perimetrales, fijaciones, junta estanca, etc. Montaje según norma de instalación UNE 102043 y exigencias del CTE.","Tabique formado por tres placas RESIST de 20 mm de espesor compuestas por yeso natural, fibra de vidrio y aditivos inorgánicos que le aportan alta dureza y resistencia mecánica. Con mayor cantidad de fibra de vidrio y dosificación modificada, aumenta su densidad, mejorando notablemente la resistencia mecánica. Idónea para lugares con altas exigencias en cuanto a deterioro y desgaste. Reacción al fuego: EUROCLASE A1. Sistema de galces desiguales: las placas encajan entre ellas dejando una entrecalle de 3 mm por donde se inserta la pasta de juntas. Este sistema no utiliza cinta de papel. La pasta de juntas se aplica en las cavidades de las placas y una masilla elástica en los encuentros. Atornillada a cada lado de una estructura metálica de acero galvanizado formada por canales de 50 mm y montantes de 51x49x49 mm con una modulación de 400 mm entre ejes, dando un ancho total de tabique de 169 mm. Incluida parte proporcional del resto de materiales: tornillería, pasta de juntas, masilla para encuentros perimetrales, fijaciones, junta estanca, etc. Montaje según norma de instalación UNE 102043 y exigencias del CTE.","Tabique formado por tres placas HIDROPLUS de 20 mm de espesor compuestas por yeso natural, fibra de vidrio y aditivos inorgánicos que le aportan alta dureza y resistencia mecánica. Incorpora tratamiento hidrófugo y un aumento en su densidad, características claves para una elevada resistencia a la humedad (absorción de agua menor al 3%) y una gran resistencia mecánica. Idónea para zonas de intemperie. Reacción al fuego: EUROCLASE A1. Sistema de galces desiguales: las placas encajan entre ellas dejando una entrecalle de 3 mm por donde se inserta la pasta de juntas. Este sistema no utiliza cinta de papel. La pasta de juntas se aplica en las cavidades de las placas y una masilla elástica en los encuentros. Atornillada a cada lado de una estructura metálica de acero galvanizado formada por canales de 50 mm y montantes de 51x49x49 mm con una modulación de 400 mm entre ejes, dando un ancho total de tabique de 169 mm. Incluida parte proporcional del resto de materiales: tornillería, pasta de juntas, masilla para encuentros perimetrales, fijaciones, junta estanca, etc. Montaje según norma de instalación UNE 102043 y exigencias del CTE.","Tabique formado por tres placas SUPREM de 20 mm de espesor compuestas por yeso natural, fibra de vidrio y aditivos inorgánicos que le aportan alta dureza y resistencia mecánica. Incorpora tratamiento hidrófugo, perlita y un aumento en la densidad para conseguir soluciones constructivas que cumplan, altos requisitos frente al fuego y una capacidad reducida de absorción de agua. Reacción al fuego: EUROCLASE A1. Sistema de galces desiguales: las placas encajan entre ellas dejando una entrecalle de 3 mm por donde se inserta la pasta de juntas. Este sistema no utiliza cinta de papel. La pasta de juntas se aplica en las cavidades de las placas y una masilla elástica en los encuentros. Atornillada a cada lado de una estructura metálica de acero galvanizado formada por canales de 50 mm y montantes de 51x49x49 mm con una modulación de 400 mm entre ejes, dando un ancho total de tabique de 169 mm. Incluida parte proporcional del resto de materiales: tornillería, pasta de juntas, masilla para encuentros perimetrales, fijaciones, junta estanca, etc. Montaje según norma de instalación UNE 102043 y exigencias del CTE."]
[null,null,47478,"1.3.13","TABIQUE ATT® 152/400 (74)  [13+13+13+74+13+13+13]",400,74,{"$f":"3*13","v":39},"Tabique formado por tres placas BASIC de 13 mm de espesor compuestas por yeso natural, fibra de vidrio y aditivos inorgánicos que le aportan alta dureza y resistencia mecánica. Reacción al fuego: EUROCLASE A1. Sistema de galces desiguales: las placas encajan entre ellas dejando una entrecalle de 3 mm por donde se inserta la pasta de juntas. Este sistema no utiliza cinta de papel. La pasta de juntas se aplica en las cavidades de las placas y una masilla elástica en los encuentros. Atornillada a cada lado de una estructura metálica de acero galvanizado formada por canales de 75 mm y montantes de 51x74x49 mm con una modulación de 400 mm entre ejes, dando un ancho total de tabique de 152 mm. Incluida parte proporcional del resto de materiales: tornillería, pasta de juntas, masilla para encuentros perimetrales, fijaciones, junta estanca, etc. Montaje según norma de instalación UNE 102043 y exigencias del CTE.","Tabique formado por tres placas HIDRO de 13 mm de espesor compuestas por yeso natural, fibra de vidrio y aditivos inorgánicos que le aportan alta dureza y resistencia mecánica. Incorpora tratamiento hidrófugo, disminuyendo así su capacidad de absorción de agua (menor al 5%). Idónea para proteger las estancias de los efectos adversos de la humedad. Reacción al fuego: EUROCLASE A1. Sistema de galces desiguales: las placas encajan entre ellas dejando una entrecalle de 3 mm por donde se inserta la pasta de juntas. Este sistema no utiliza cinta de papel. La pasta de juntas se aplica en las cavidades de las placas y una masilla elástica en los encuentros. Atornillada a cada lado de una estructura metálica de acero galvanizado formada por canales de 75 mm y montantes de 51x74x49 mm con una modulación de 400 mm entre ejes, dando un ancho total de tabique de 152 mm. Incluida parte proporcional del resto de materiales: tornillería, pasta de juntas, masilla para encuentros perimetrales, fijaciones, junta estanca, etc. Montaje según norma de instalación UNE 102043 y exigencias del CTE.","Tabique formado por tres placas FUEGO de 13 mm de espesor compuestas por yeso natural, fibra de vidrio y aditivos inorgánicos que le aportan alta dureza y resistencia mecánica. Incorpora perlita y un aumento en la densidad que la hace idónea para un excelente comportamiento y resistencia frente al fuego. Reacción al fuego: EUROCLASE A1. Sistema de galces desiguales: las placas encajan entre ellas dejando una entrecalle de 3 mm por donde se inserta la pasta de juntas. Este sistema no utiliza cinta de papel. La pasta de juntas se aplica en las cavidades de las placas y una masilla elástica en los encuentros. Atornillada a cada lado de una estructura metálica de acero galvanizado formada por canales de 75 mm y montantes de 51x74x49 mm con una modulación de 400 mm entre ejes, dando un ancho total de tabique de 152 mm. Incluida parte proporcional del resto de materiales: tornillería, pasta de juntas, masilla para encuentros perimetrales, fijaciones, junta estanca, etc. Montaje según norma de instalación UNE 102043 y exigencias del CTE.","Tabique formado por tres placas RESIST de 13 mm de espesor compuestas por yeso natural, fibra de vidrio y aditivos inorgánicos que le aportan alta dureza y resistencia mecánica. Con mayor cantidad de fibra de vidrio y dosificación modificada, aumenta su densidad, mejorando notablemente la resistencia mecánica. Idónea para lugares con altas exigencias en cuanto a deterioro y desgaste. Reacción al fuego: EUROCLASE A1. Sistema de galces desiguales: las placas encajan entre ellas dejando una entrecalle de 3 mm por donde se inserta la pasta de juntas. Este sistema no utiliza cinta de papel. La pasta de juntas se aplica en las cavidades de las placas y una masilla elástica en los encuentros. Atornillada a cada lado de una estructura metálica de acero galvanizado formada por canales de 75 mm y montantes de 51x74x49 mm con una modulación de 400 mm entre ejes, dando un ancho total de tabique de 152 mm. Incluida parte proporcional del resto de materiales: tornillería, pasta de juntas, masilla para encuentros perimetrales, fijaciones, junta estanca, etc. Montaje según norma de instalación UNE 102043 y exigencias del CTE.","Tabique formado por tres placas HIDROPLUS de 13 mm de espesor compuestas por yeso natural, fibra de vidrio y aditivos inorgánicos que le aportan alta dureza y resistencia mecánica. Incorpora tratamiento hidrófugo y un aumento en su densidad, características claves para una elevada resistencia a la humedad (absorción de agua menor al 3%) y una gran resistencia mecánica. Idónea para zonas de intemperie. Reacción al fuego: EUROCLASE A1. Sistema de galces desiguales: las placas encajan entre ellas dejando una entrecalle de 3 mm por donde se inserta la pasta de juntas. Este sistema no utiliza cinta de papel. La pasta de juntas se aplica en las cavidades de las placas y una masilla elástica en los encuentros. Atornillada a cada lado de una estructura metálica de acero galvanizado formada por canales de 75 mm y montantes de 51x74x49 mm con una modulación de 400 mm entre ejes, dando un ancho total de tabique de 152 mm. Incluida parte proporcional del resto de materiales: tornillería, pasta de juntas, masilla para encuentros perimetrales, fijaciones, junta estanca, etc. Montaje según norma de instalación UNE 102043 y exigencias del CTE.","Tabique formado por tres placas SUPREM de 13 mm de espesor compuestas por yeso natural, fibra de vidrio y aditivos inorgánicos que le aportan alta dureza y resistencia mecánica. Incorpora tratamiento hidrófugo, perlita y un aumento en la densidad para conseguir soluciones constructivas que cumplan, altos requisitos frente al fuego y una capacidad reducida de absorción de agua. Reacción al fuego: EUROCLASE A1. Sistema de galces desiguales: las placas encajan entre ellas dejando una entrecalle de 3 mm por donde se inserta la pasta de juntas. Este sistema no utiliza cinta de papel. La pasta de juntas se aplica en las cavidades de las placas y una masilla elástica en los encuentros. Atornillada a cada lado de una estructura metálica de acero galvanizado formada por canales de 75 mm y montantes de 51x74x49 mm con una modulación de 400 mm entre ejes, dando un ancho total de tabique de 152 mm. Incluida parte proporcional del resto de materiales: tornillería, pasta de juntas, masilla para encuentros perimetrales, fijaciones, junta estanca, etc. Montaje según norma de instalación UNE 102043 y exigencias del CTE."]
[null,null,47490,"1.3.14","TABIQUE ATT® 164/400 (74)  [15+15+15+74+15+15+15]",400,74,{"$f":"3*15","v":45},"Tabique formado por tres placas BASIC de 15 mm de espesor compuestas por yeso natural, fibra de vidrio y aditivos inorgánicos que le aportan alta dureza y resistencia mecánica. Reacción al fuego: EUROCLASE A1. Sistema de galces desiguales: las placas encajan entre ellas dejando una entrecalle de 3 mm por donde se inserta la pasta de juntas. Este sistema no utiliza cinta de papel. La pasta de juntas se aplica en las cavidades de las placas y una masilla elástica en los encuentros. Atornillada a cada lado de una estructura metálica de acero galvanizado formada por canales de 75 mm y montantes de 51x74x49 mm con una modulación de 400 mm entre ejes, dando un ancho total de tabique de 164 mm. Incluida parte proporcional del resto de materiales: tornillería, pasta de juntas, masilla para encuentros perimetrales, fijaciones, junta estanca, etc. Montaje según norma de instalación UNE 102043 y exigencias del CTE.","Tabique formado por tres placas HIDRO de 15 mm de espesor compuestas por yeso natural, fibra de vidrio y aditivos inorgánicos que le aportan alta dureza y resistencia mecánica. Incorpora tratamiento hidrófugo, disminuyendo así su capacidad de absorción de agua (menor al 5%). Idónea para proteger las estancias de los efectos adversos de la humedad. Reacción al fuego: EUROCLASE A1. Sistema de galces desiguales: las placas encajan entre ellas dejando una entrecalle de 3 mm por donde se inserta la pasta de juntas. Este sistema no utiliza cinta de papel. La pasta de juntas se aplica en las cavidades de las placas y una masilla elástica en los encuentros. Atornillada a cada lado de una estructura metálica de acero galvanizado formada por canales de 75 mm y montantes de 51x74x49 mm con una modulación de 400 mm entre ejes, dando un ancho total de tabique de 164 mm. Incluida parte proporcional del resto de materiales: tornillería, pasta de juntas, masilla para encuentros perimetrales, fijaciones, junta estanca, etc. Montaje según norma de instalación UNE 102043 y exigencias del CTE.","Tabique formado por tres placas FUEGO de 15 mm de espesor compuestas por yeso natural, fibra de vidrio y aditivos inorgánicos que le aportan alta dureza y resistencia mecánica. Incorpora perlita y un aumento en la densidad que la hace idónea para un excelente comportamiento y resistencia frente al fuego. Reacción al fuego: EUROCLASE A1. Sistema de galces desiguales: las placas encajan entre ellas dejando una entrecalle de 3 mm por donde se inserta la pasta de juntas. Este sistema no utiliza cinta de papel. La pasta de juntas se aplica en las cavidades de las placas y una masilla elástica en los encuentros. Atornillada a cada lado de una estructura metálica de acero galvanizado formada por canales de 75 mm y montantes de 51x74x49 mm con una modulación de 400 mm entre ejes, dando un ancho total de tabique de 164 mm. Incluida parte proporcional del resto de materiales: tornillería, pasta de juntas, masilla para encuentros perimetrales, fijaciones, junta estanca, etc. Montaje según norma de instalación UNE 102043 y exigencias del CTE.","Tabique formado por tres placas RESIST de 15 mm de espesor compuestas por yeso natural, fibra de vidrio y aditivos inorgánicos que le aportan alta dureza y resistencia mecánica. Con mayor cantidad de fibra de vidrio y dosificación modificada, aumenta su densidad, mejorando notablemente la resistencia mecánica. Idónea para lugares con altas exigencias en cuanto a deterioro y desgaste. Reacción al fuego: EUROCLASE A1. Sistema de galces desiguales: las placas encajan entre ellas dejando una entrecalle de 3 mm por donde se inserta la pasta de juntas. Este sistema no utiliza cinta de papel. La pasta de juntas se aplica en las cavidades de las placas y una masilla elástica en los encuentros. Atornillada a cada lado de una estructura metálica de acero galvanizado formada por canales de 75 mm y montantes de 51x74x49 mm con una modulación de 400 mm entre ejes, dando un ancho total de tabique de 164 mm. Incluida parte proporcional del resto de materiales: tornillería, pasta de juntas, masilla para encuentros perimetrales, fijaciones, junta estanca, etc. Montaje según norma de instalación UNE 102043 y exigencias del CTE.","Tabique formado por tres placas HIDROPLUS de 15 mm de espesor compuestas por yeso natural, fibra de vidrio y aditivos inorgánicos que le aportan alta dureza y resistencia mecánica. Incorpora tratamiento hidrófugo y un aumento en su densidad, características claves para una elevada resistencia a la humedad (absorción de agua menor al 3%) y una gran resistencia mecánica. Idónea para zonas de intemperie. Reacción al fuego: EUROCLASE A1. Sistema de galces desiguales: las placas encajan entre ellas dejando una entrecalle de 3 mm por donde se inserta la pasta de juntas. Este sistema no utiliza cinta de papel. La pasta de juntas se aplica en las cavidades de las placas y una masilla elástica en los encuentros. Atornillada a cada lado de una estructura metálica de acero galvanizado formada por canales de 75 mm y montantes de 51x74x49 mm con una modulación de 400 mm entre ejes, dando un ancho total de tabique de 164 mm. Incluida parte proporcional del resto de materiales: tornillería, pasta de juntas, masilla para encuentros perimetrales, fijaciones, junta estanca, etc. Montaje según norma de instalación UNE 102043 y exigencias del CTE.","Tabique formado por tres placas SUPREM de 15 mm de espesor compuestas por yeso natural, fibra de vidrio y aditivos inorgánicos que le aportan alta dureza y resistencia mecánica. Incorpora tratamiento hidrófugo, perlita y un aumento en la densidad para conseguir soluciones constructivas que cumplan, altos requisitos frente al fuego y una capacidad reducida de absorción de agua. Reacción al fuego: EUROCLASE A1. Sistema de galces desiguales: las placas encajan entre ellas dejando una entrecalle de 3 mm por donde se inserta la pasta de juntas. Este sistema no utiliza cinta de papel. La pasta de juntas se aplica en las cavidades de las placas y una masilla elástica en los encuentros. Atornillada a cada lado de una estructura metálica de acero galvanizado formada por canales de 75 mm y montantes de 51x74x49 mm con una modulación de 400 mm entre ejes, dando un ancho total de tabique de 164 mm. Incluida parte proporcional del resto de materiales: tornillería, pasta de juntas, masilla para encuentros perimetrales, fijaciones, junta estanca, etc. Montaje según norma de instalación UNE 102043 y exigencias del CTE."]
[null,null,47520,"1.3.15","TABIQUE ATT® 194/400 (74)  [20+20+20+74+20+20+20]",400,74,{"$f":"3*20","v":60},"Tabique formado por tres placas BASIC de 20 mm de espesor compuestas por yeso natural, fibra de vidrio y aditivos inorgánicos que le aportan alta dureza y resistencia mecánica. Reacción al fuego: EUROCLASE A1. Sistema de galces desiguales: las placas encajan entre ellas dejando una entrecalle de 3 mm por donde se inserta la pasta de juntas. Este sistema no utiliza cinta de papel. La pasta de juntas se aplica en las cavidades de las placas y una masilla elástica en los encuentros. Atornillada a cada lado de una estructura metálica de acero galvanizado formada por canales de 75 mm y montantes de 51x74x49 mm con una modulación de 400 mm entre ejes, dando un ancho total de tabique de 194 mm. Incluida parte proporcional del resto de materiales: tornillería, pasta de juntas, masilla para encuentros perimetrales, fijaciones, junta estanca, etc. Montaje según norma de instalación UNE 102043 y exigencias del CTE.","Tabique formado por tres placas HIDRO de 20 mm de espesor compuestas por yeso natural, fibra de vidrio y aditivos inorgánicos que le aportan alta dureza y resistencia mecánica. Incorpora tratamiento hidrófugo, disminuyendo así su capacidad de absorción de agua (menor al 5%). Idónea para proteger las estancias de los efectos adversos de la humedad. Reacción al fuego: EUROCLASE A1. Sistema de galces desiguales: las placas encajan entre ellas dejando una entrecalle de 3 mm por donde se inserta la pasta de juntas. Este sistema no utiliza cinta de papel. La pasta de juntas se aplica en las cavidades de las placas y una masilla elástica en los encuentros. Atornillada a cada lado de una estructura metálica de acero galvanizado formada por canales de 75 mm y montantes de 51x74x49 mm con una modulación de 400 mm entre ejes, dando un ancho total de tabique de 194 mm. Incluida parte proporcional del resto de materiales: tornillería, pasta de juntas, masilla para encuentros perimetrales, fijaciones, junta estanca, etc. Montaje según norma de instalación UNE 102043 y exigencias del CTE.","Tabique formado por tres placas FUEGO de 20 mm de espesor compuestas por yeso natural, fibra de vidrio y aditivos inorgánicos que le aportan alta dureza y resistencia mecánica. Incorpora perlita y un aumento en la densidad que la hace idónea para un excelente comportamiento y resistencia frente al fuego. Reacción al fuego: EUROCLASE A1. Sistema de galces desiguales: las placas encajan entre ellas dejando una entrecalle de 3 mm por donde se inserta la pasta de juntas. Este sistema no utiliza cinta de papel. La pasta de juntas se aplica en las cavidades de las placas y una masilla elástica en los encuentros. Atornillada a cada lado de una estructura metálica de acero galvanizado formada por canales de 75 mm y montantes de 51x74x49 mm con una modulación de 400 mm entre ejes, dando un ancho total de tabique de 194 mm. Incluida parte proporcional del resto de materiales: tornillería, pasta de juntas, masilla para encuentros perimetrales, fijaciones, junta estanca, etc. Montaje según norma de instalación UNE 102043 y exigencias del CTE.","Tabique formado por tres placas RESIST de 20 mm de espesor compuestas por yeso natural, fibra de vidrio y aditivos inorgánicos que le aportan alta dureza y resistencia mecánica. Con mayor cantidad de fibra de vidrio y dosificación modificada, aumenta su densidad, mejorando notablemente la resistencia mecánica. Idónea para lugares con altas exigencias en cuanto a deterioro y desgaste. Reacción al fuego: EUROCLASE A1. Sistema de galces desiguales: las placas encajan entre ellas dejando una entrecalle de 3 mm por donde se inserta la pasta de juntas. Este sistema no utiliza cinta de papel. La pasta de juntas se aplica en las cavidades de las placas y una masilla elástica en los encuentros. Atornillada a cada lado de una estructura metálica de acero galvanizado formada por canales de 75 mm y montantes de 51x74x49 mm con una modulación de 400 mm entre ejes, dando un ancho total de tabique de 194 mm. Incluida parte proporcional del resto de materiales: tornillería, pasta de juntas, masilla para encuentros perimetrales, fijaciones, junta estanca, etc. Montaje según norma de instalación UNE 102043 y exigencias del CTE.","Tabique formado por tres placas HIDROPLUS de 20 mm de espesor compuestas por yeso natural, fibra de vidrio y aditivos inorgánicos que le aportan alta dureza y resistencia mecánica. Incorpora tratamiento hidrófugo y un aumento en su densidad, características claves para una elevada resistencia a la humedad (absorción de agua menor al 3%) y una gran resistencia mecánica. Idónea para zonas de intemperie. Reacción al fuego: EUROCLASE A1. Sistema de galces desiguales: las placas encajan entre ellas dejando una entrecalle de 3 mm por donde se inserta la pasta de juntas. Este sistema no utiliza cinta de papel. La pasta de juntas se aplica en las cavidades de las placas y una masilla elástica en los encuentros. Atornillada a cada lado de una estructura metálica de acero galvanizado formada por canales de 75 mm y montantes de 51x74x49 mm con una modulación de 400 mm entre ejes, dando un ancho total de tabique de 194 mm. Incluida parte proporcional del resto de materiales: tornillería, pasta de juntas, masilla para encuentros perimetrales, fijaciones, junta estanca, etc. Montaje según norma de instalación UNE 102043 y exigencias del CTE.","Tabique formado por tres placas SUPREM de 20 mm de espesor compuestas por yeso natural, fibra de vidrio y aditivos inorgánicos que le aportan alta dureza y resistencia mecánica. Incorpora tratamiento hidrófugo, perlita y un aumento en la densidad para conseguir soluciones constructivas que cumplan, altos requisitos frente al fuego y una capacidad reducida de absorción de agua. Reacción al fuego: EUROCLASE A1. Sistema de galces desiguales: las placas encajan entre ellas dejando una entrecalle de 3 mm por donde se inserta la pasta de juntas. Este sistema no utiliza cinta de papel. La pasta de juntas se aplica en las cavidades de las placas y una masilla elástica en los encuentros. Atornillada a cada lado de una estructura metálica de acero galvanizado formada por canales de 75 mm y montantes de 51x74x49 mm con una modulación de 400 mm entre ejes, dando un ancho total de tabique de 194 mm. Incluida parte proporcional del resto de materiales: tornillería, pasta de juntas, masilla para encuentros perimetrales, fijaciones, junta estanca, etc. Montaje según norma de instalación UNE 102043 y exigencias del CTE."]
[null,null,49978,"1.3.16","TABIQUE ATT® 177/400 (99)  [13+13+13+99+13+13+13]",400,99,{"$f":"3*13","v":39},"Tabique formado por tres placas BASIC de 13 mm de espesor compuestas por yeso natural, fibra de vidrio y aditivos inorgánicos que le aportan alta dureza y resistencia mecánica. Reacción al fuego: EUROCLASE A1. Sistema de galces desiguales: las placas encajan entre ellas dejando una entrecalle de 3 mm por donde se inserta la pasta de juntas. Este sistema no utiliza cinta de papel. La pasta de juntas se aplica en las cavidades de las placas y una masilla elástica en los encuentros. Atornillada a cada lado de una estructura metálica de acero galvanizado formada por canales de 100 mm y montantes de 51x99x49 mm con una modulación de 400 mm entre ejes, dando un ancho total de tabique de 177 mm. Incluida parte proporcional del resto de materiales: tornillería, pasta de juntas, masilla para encuentros perimetrales, fijaciones, junta estanca, etc. Montaje según norma de instalación UNE 102043 y exigencias del CTE.","Tabique formado por tres placas HIDRO de 13 mm de espesor compuestas por yeso natural, fibra de vidrio y aditivos inorgánicos que le aportan alta dureza y resistencia mecánica. Incorpora tratamiento hidrófugo, disminuyendo así su capacidad de absorción de agua (menor al 5%). Idónea para proteger las estancias de los efectos adversos de la humedad. Reacción al fuego: EUROCLASE A1. Sistema de galces desiguales: las placas encajan entre ellas dejando una entrecalle de 3 mm por donde se inserta la pasta de juntas. Este sistema no utiliza cinta de papel. La pasta de juntas se aplica en las cavidades de las placas y una masilla elástica en los encuentros. Atornillada a cada lado de una estructura metálica de acero galvanizado formada por canales de 100 mm y montantes de 51x99x49 mm con una modulación de 400 mm entre ejes, dando un ancho total de tabique de 177 mm. Incluida parte proporcional del resto de materiales: tornillería, pasta de juntas, masilla para encuentros perimetrales, fijaciones, junta estanca, etc. Montaje según norma de instalación UNE 102043 y exigencias del CTE.","Tabique formado por tres placas FUEGO de 13 mm de espesor compuestas por yeso natural, fibra de vidrio y aditivos inorgánicos que le aportan alta dureza y resistencia mecánica. Incorpora perlita y un aumento en la densidad que la hace idónea para un excelente comportamiento y resistencia frente al fuego. Reacción al fuego: EUROCLASE A1. Sistema de galces desiguales: las placas encajan entre ellas dejando una entrecalle de 3 mm por donde se inserta la pasta de juntas. Este sistema no utiliza cinta de papel. La pasta de juntas se aplica en las cavidades de las placas y una masilla elástica en los encuentros. Atornillada a cada lado de una estructura metálica de acero galvanizado formada por canales de 100 mm y montantes de 51x99x49 mm con una modulación de 400 mm entre ejes, dando un ancho total de tabique de 177 mm. Incluida parte proporcional del resto de materiales: tornillería, pasta de juntas, masilla para encuentros perimetrales, fijaciones, junta estanca, etc. Montaje según norma de instalación UNE 102043 y exigencias del CTE.","Tabique formado por tres placas RESIST de 13 mm de espesor compuestas por yeso natural, fibra de vidrio y aditivos inorgánicos que le aportan alta dureza y resistencia mecánica. Con mayor cantidad de fibra de vidrio y dosificación modificada, aumenta su densidad, mejorando notablemente la resistencia mecánica. Idónea para lugares con altas exigencias en cuanto a deterioro y desgaste. Reacción al fuego: EUROCLASE A1. Sistema de galces desiguales: las placas encajan entre ellas dejando una entrecalle de 3 mm por donde se inserta la pasta de juntas. Este sistema no utiliza cinta de papel. La pasta de juntas se aplica en las cavidades de las placas y una masilla elástica en los encuentros. Atornillada a cada lado de una estructura metálica de acero galvanizado formada por canales de 100 mm y montantes de 51x99x49 mm con una modulación de 400 mm entre ejes, dando un ancho total de tabique de 177 mm. Incluida parte proporcional del resto de materiales: tornillería, pasta de juntas, masilla para encuentros perimetrales, fijaciones, junta estanca, etc. Montaje según norma de instalación UNE 102043 y exigencias del CTE.","Tabique formado por tres placas HIDROPLUS de 13 mm de espesor compuestas por yeso natural, fibra de vidrio y aditivos inorgánicos que le aportan alta dureza y resistencia mecánica. Incorpora tratamiento hidrófugo y un aumento en su densidad, características claves para una elevada resistencia a la humedad (absorción de agua menor al 3%) y una gran resistencia mecánica. Idónea para zonas de intemperie. Reacción al fuego: EUROCLASE A1. Sistema de galces desiguales: las placas encajan entre ellas dejando una entrecalle de 3 mm por donde se inserta la pasta de juntas. Este sistema no utiliza cinta de papel. La pasta de juntas se aplica en las cavidades de las placas y una masilla elástica en los encuentros. Atornillada a cada lado de una estructura metálica de acero galvanizado formada por canales de 100 mm y montantes de 51x99x49 mm con una modulación de 400 mm entre ejes, dando un ancho total de tabique de 177 mm. Incluida parte proporcional del resto de materiales: tornillería, pasta de juntas, masilla para encuentros perimetrales, fijaciones, junta estanca, etc. Montaje según norma de instalación UNE 102043 y exigencias del CTE.","Tabique formado por tres placas SUPREM de 13 mm de espesor compuestas por yeso natural, fibra de vidrio y aditivos inorgánicos que le aportan alta dureza y resistencia mecánica. Incorpora tratamiento hidrófugo, perlita y un aumento en la densidad para conseguir soluciones constructivas que cumplan, altos requisitos frente al fuego y una capacidad reducida de absorción de agua. Reacción al fuego: EUROCLASE A1. Sistema de galces desiguales: las placas encajan entre ellas dejando una entrecalle de 3 mm por donde se inserta la pasta de juntas. Este sistema no utiliza cinta de papel. La pasta de juntas se aplica en las cavidades de las placas y una masilla elástica en los encuentros. Atornillada a cada lado de una estructura metálica de acero galvanizado formada por canales de 100 mm y montantes de 51x99x49 mm con una modulación de 400 mm entre ejes, dando un ancho total de tabique de 177 mm. Incluida parte proporcional del resto de materiales: tornillería, pasta de juntas, masilla para encuentros perimetrales, fijaciones, junta estanca, etc. Montaje según norma de instalación UNE 102043 y exigencias del CTE."]
[null,null,49990,"1.3.17","TABIQUE ATT® 189/400 (99)  [15+15+15+99+15+15+15]",400,99,{"$f":"3*15","v":45},"Tabique formado por tres placas BASIC de 15 mm de espesor compuestas por yeso natural, fibra de vidrio y aditivos inorgánicos que le aportan alta dureza y resistencia mecánica. Reacción al fuego: EUROCLASE A1. Sistema de galces desiguales: las placas encajan entre ellas dejando una entrecalle de 3 mm por donde se inserta la pasta de juntas. Este sistema no utiliza cinta de papel. La pasta de juntas se aplica en las cavidades de las placas y una masilla elástica en los encuentros. Atornillada a cada lado de una estructura metálica de acero galvanizado formada por canales de 100 mm y montantes de 51x99x49 mm con una modulación de 400 mm entre ejes, dando un ancho total de tabique de 189 mm. Incluida parte proporcional del resto de materiales: tornillería, pasta de juntas, masilla para encuentros perimetrales, fijaciones, junta estanca, etc. Montaje según norma de instalación UNE 102043 y exigencias del CTE.","Tabique formado por tres placas HIDRO de 15 mm de espesor compuestas por yeso natural, fibra de vidrio y aditivos inorgánicos que le aportan alta dureza y resistencia mecánica. Incorpora tratamiento hidrófugo, disminuyendo así su capacidad de absorción de agua (menor al 5%). Idónea para proteger las estancias de los efectos adversos de la humedad. Reacción al fuego: EUROCLASE A1. Sistema de galces desiguales: las placas encajan entre ellas dejando una entrecalle de 3 mm por donde se inserta la pasta de juntas. Este sistema no utiliza cinta de papel. La pasta de juntas se aplica en las cavidades de las placas y una masilla elástica en los encuentros. Atornillada a cada lado de una estructura metálica de acero galvanizado formada por canales de 100 mm y montantes de 51x99x49 mm con una modulación de 400 mm entre ejes, dando un ancho total de tabique de 189 mm. Incluida parte proporcional del resto de materiales: tornillería, pasta de juntas, masilla para encuentros perimetrales, fijaciones, junta estanca, etc. Montaje según norma de instalación UNE 102043 y exigencias del CTE.","Tabique formado por tres placas FUEGO de 15 mm de espesor compuestas por yeso natural, fibra de vidrio y aditivos inorgánicos que le aportan alta dureza y resistencia mecánica. Incorpora perlita y un aumento en la densidad que la hace idónea para un excelente comportamiento y resistencia frente al fuego. Reacción al fuego: EUROCLASE A1. Sistema de galces desiguales: las placas encajan entre ellas dejando una entrecalle de 3 mm por donde se inserta la pasta de juntas. Este sistema no utiliza cinta de papel. La pasta de juntas se aplica en las cavidades de las placas y una masilla elástica en los encuentros. Atornillada a cada lado de una estructura metálica de acero galvanizado formada por canales de 100 mm y montantes de 51x99x49 mm con una modulación de 400 mm entre ejes, dando un ancho total de tabique de 189 mm. Incluida parte proporcional del resto de materiales: tornillería, pasta de juntas, masilla para encuentros perimetrales, fijaciones, junta estanca, etc. Montaje según norma de instalación UNE 102043 y exigencias del CTE.","Tabique formado por tres placas RESIST de 15 mm de espesor compuestas por yeso natural, fibra de vidrio y aditivos inorgánicos que le aportan alta dureza y resistencia mecánica. Con mayor cantidad de fibra de vidrio y dosificación modificada, aumenta su densidad, mejorando notablemente la resistencia mecánica. Idónea para lugares con altas exigencias en cuanto a deterioro y desgaste. Reacción al fuego: EUROCLASE A1. Sistema de galces desiguales: las placas encajan entre ellas dejando una entrecalle de 3 mm por donde se inserta la pasta de juntas. Este sistema no utiliza cinta de papel. La pasta de juntas se aplica en las cavidades de las placas y una masilla elástica en los encuentros. Atornillada a cada lado de una estructura metálica de acero galvanizado formada por canales de 100 mm y montantes de 51x99x49 mm con una modulación de 400 mm entre ejes, dando un ancho total de tabique de 189 mm. Incluida parte proporcional del resto de materiales: tornillería, pasta de juntas, masilla para encuentros perimetrales, fijaciones, junta estanca, etc. Montaje según norma de instalación UNE 102043 y exigencias del CTE.","Tabique formado por tres placas HIDROPLUS de 15 mm de espesor compuestas por yeso natural, fibra de vidrio y aditivos inorgánicos que le aportan alta dureza y resistencia mecánica. Incorpora tratamiento hidrófugo y un aumento en su densidad, características claves para una elevada resistencia a la humedad (absorción de agua menor al 3%) y una gran resistencia mecánica. Idónea para zonas de intemperie. Reacción al fuego: EUROCLASE A1. Sistema de galces desiguales: las placas encajan entre ellas dejando una entrecalle de 3 mm por donde se inserta la pasta de juntas. Este sistema no utiliza cinta de papel. La pasta de juntas se aplica en las cavidades de las placas y una masilla elástica en los encuentros. Atornillada a cada lado de una estructura metálica de acero galvanizado formada por canales de 100 mm y montantes de 51x99x49 mm con una modulación de 400 mm entre ejes, dando un ancho total de tabique de 189 mm. Incluida parte proporcional del resto de materiales: tornillería, pasta de juntas, masilla para encuentros perimetrales, fijaciones, junta estanca, etc. Montaje según norma de instalación UNE 102043 y exigencias del CTE.","Tabique formado por tres placas SUPREM de 15 mm de espesor compuestas por yeso natural, fibra de vidrio y aditivos inorgánicos que le aportan alta dureza y resistencia mecánica. Incorpora tratamiento hidrófugo, perlita y un aumento en la densidad para conseguir soluciones constructivas que cumplan, altos requisitos frente al fuego y una capacidad reducida de absorción de agua. Reacción al fuego: EUROCLASE A1. Sistema de galces desiguales: las placas encajan entre ellas dejando una entrecalle de 3 mm por donde se inserta la pasta de juntas. Este sistema no utiliza cinta de papel. La pasta de juntas se aplica en las cavidades de las placas y una masilla elástica en los encuentros. Atornillada a cada lado de una estructura metálica de acero galvanizado formada por canales de 100 mm y montantes de 51x99x49 mm con una modulación de 400 mm entre ejes, dando un ancho total de tabique de 189 mm. Incluida parte proporcional del resto de materiales: tornillería, pasta de juntas, masilla para encuentros perimetrales, fijaciones, junta estanca, etc. Montaje según norma de instalación UNE 102043 y exigencias del CTE."]
[null,null,50020,"1.3.18","TABIQUE ATT® 219/400 (99)  [20+20+20+99+20+20+20]",400,99,{"$f":"3*20","v":60},"Tabique formado por tres placas BASIC de 20 mm de espesor compuestas por yeso natural, fibra de vidrio y aditivos inorgánicos que le aportan alta dureza y resistencia mecánica. Reacción al fuego: EUROCLASE A1. Sistema de galces desiguales: las placas encajan entre ellas dejando una entrecalle de 3 mm por donde se inserta la pasta de juntas. Este sistema no utiliza cinta de papel. La pasta de juntas se aplica en las cavidades de las placas y una masilla elástica en los encuentros. Atornillada a cada lado de una estructura metálica de acero galvanizado formada por canales de 100 mm y montantes de 51x99x49 mm con una modulación de 400 mm entre ejes, dando un ancho total de tabique de 219 mm. Incluida parte proporcional del resto de materiales: tornillería, pasta de juntas, masilla para encuentros perimetrales, fijaciones, junta estanca, etc. Montaje según norma de instalación UNE 102043 y exigencias del CTE.","Tabique formado por tres placas HIDRO de 20 mm de espesor compuestas por yeso natural, fibra de vidrio y aditivos inorgánicos que le aportan alta dureza y resistencia mecánica. Incorpora tratamiento hidrófugo, disminuyendo así su capacidad de absorción de agua (menor al 5%). Idónea para proteger las estancias de los efectos adversos de la humedad. Reacción al fuego: EUROCLASE A1. Sistema de galces desiguales: las placas encajan entre ellas dejando una entrecalle de 3 mm por donde se inserta la pasta de juntas. Este sistema no utiliza cinta de papel. La pasta de juntas se aplica en las cavidades de las placas y una masilla elástica en los encuentros. Atornillada a cada lado de una estructura metálica de acero galvanizado formada por canales de 100 mm y montantes de 51x99x49 mm con una modulación de 400 mm entre ejes, dando un ancho total de tabique de 219 mm. Incluida parte proporcional del resto de materiales: tornillería, pasta de juntas, masilla para encuentros perimetrales, fijaciones, junta estanca, etc. Montaje según norma de instalación UNE 102043 y exigencias del CTE.","Tabique formado por tres placas FUEGO de 20 mm de espesor compuestas por yeso natural, fibra de vidrio y aditivos inorgánicos que le aportan alta dureza y resistencia mecánica. Incorpora perlita y un aumento en la densidad que la hace idónea para un excelente comportamiento y resistencia frente al fuego. Reacción al fuego: EUROCLASE A1. Sistema de galces desiguales: las placas encajan entre ellas dejando una entrecalle de 3 mm por donde se inserta la pasta de juntas. Este sistema no utiliza cinta de papel. La pasta de juntas se aplica en las cavidades de las placas y una masilla elástica en los encuentros. Atornillada a cada lado de una estructura metálica de acero galvanizado formada por canales de 100 mm y montantes de 51x99x49 mm con una modulación de 400 mm entre ejes, dando un ancho total de tabique de 219 mm. Incluida parte proporcional del resto de materiales: tornillería, pasta de juntas, masilla para encuentros perimetrales, fijaciones, junta estanca, etc. Montaje según norma de instalación UNE 102043 y exigencias del CTE.","Tabique formado por tres placas RESIST de 20 mm de espesor compuestas por yeso natural, fibra de vidrio y aditivos inorgánicos que le aportan alta dureza y resistencia mecánica. Con mayor cantidad de fibra de vidrio y dosificación modificada, aumenta su densidad, mejorando notablemente la resistencia mecánica. Idónea para lugares con altas exigencias en cuanto a deterioro y desgaste. Reacción al fuego: EUROCLASE A1. Sistema de galces desiguales: las placas encajan entre ellas dejando una entrecalle de 3 mm por donde se inserta la pasta de juntas. Este sistema no utiliza cinta de papel. La pasta de juntas se aplica en las cavidades de las placas y una masilla elástica en los encuentros. Atornillada a cada lado de una estructura metálica de acero galvanizado formada por canales de 100 mm y montantes de 51x99x49 mm con una modulación de 400 mm entre ejes, dando un ancho total de tabique de 219 mm. Incluida parte proporcional del resto de materiales: tornillería, pasta de juntas, masilla para encuentros perimetrales, fijaciones, junta estanca, etc. Montaje según norma de instalación UNE 102043 y exigencias del CTE.","Tabique formado por tres placas HIDROPLUS de 20 mm de espesor compuestas por yeso natural, fibra de vidrio y aditivos inorgánicos que le aportan alta dureza y resistencia mecánica. Incorpora tratamiento hidrófugo y un aumento en su densidad, características claves para una elevada resistencia a la humedad (absorción de agua menor al 3%) y una gran resistencia mecánica. Idónea para zonas de intemperie. Reacción al fuego: EUROCLASE A1. Sistema de galces desiguales: las placas encajan entre ellas dejando una entrecalle de 3 mm por donde se inserta la pasta de juntas. Este sistema no utiliza cinta de papel. La pasta de juntas se aplica en las cavidades de las placas y una masilla elástica en los encuentros. Atornillada a cada lado de una estructura metálica de acero galvanizado formada por canales de 100 mm y montantes de 51x99x49 mm con una modulación de 400 mm entre ejes, dando un ancho total de tabique de 219 mm. Incluida parte proporcional del resto de materiales: tornillería, pasta de juntas, masilla para encuentros perimetrales, fijaciones, junta estanca, etc. Montaje según norma de instalación UNE 102043 y exigencias del CTE.","Tabique formado por tres placas SUPREM de 20 mm de espesor compuestas por yeso natural, fibra de vidrio y aditivos inorgánicos que le aportan alta dureza y resistencia mecánica. Incorpora tratamiento hidrófugo, perlita y un aumento en la densidad para conseguir soluciones constructivas que cumplan, altos requisitos frente al fuego y una capacidad reducida de absorción de agua. Reacción al fuego: EUROCLASE A1. Sistema de galces desiguales: las placas encajan entre ellas dejando una entrecalle de 3 mm por donde se inserta la pasta de juntas. Este sistema no utiliza cinta de papel. La pasta de juntas se aplica en las cavidades de las placas y una masilla elástica en los encuentros. Atornillada a cada lado de una estructura metálica de acero galvanizado formada por canales de 100 mm y montantes de 51x99x49 mm con una modulación de 400 mm entre ejes, dando un ancho total de tabique de 219 mm. Incluida parte proporcional del resto de materiales: tornillería, pasta de juntas, masilla para encuentros perimetrales, fijaciones, junta estanca, etc. Montaje según norma de instalación UNE 102043 y exigencias del CTE."]
[null,null,{"$f":"F59*100+G59*100+H59*5","v":64965},"2.1.1","TABIQUE MIXTO ATT® 75/600 (49)  [13+49+13]",600,49,13,"-","Tabique mixto formado por una placa BASIC de 13 mm de espesor compuesta por yeso natural, fibra de vidrio y aditivos inorgánicos que le aportan alta dureza y resistencia mecánica. Al otro lado, incorpora una placa HIDRO de 13 mm con tratamiento hidrófugo, disminuyendo así su capacidad de absorción de agua (menor al 5%). Idónea para proteger las estancias de los efectos adversos de la humedad. Reacción al fuego: EUROCLASE A1. Sistema de galces desiguales: las placas encajan entre ellas dejando una entrecalle de 3 mm por donde se inserta la pasta de juntas. Este sistema no utiliza cinta de papel. La pasta de juntas se aplica en las cavidades de las placas y una masilla elástica en los encuentros. Atornillada a cada lado de una estructura metálica de acero galvanizado formada por canales de 50 mm y montantes de 51x49x49 mm con una modulación de 600 mm entre ejes, dando un ancho total de tabique de 75 mm. Incluida parte proporcional del resto de materiales: tornillería, pasta de juntas, masilla para encuentros perimetrales, fijaciones, junta estanca, etc. Montaje según norma de instalación UNE 102043 y exigencias del CTE.","Tabique mixto formado por una placa BASIC de 13 mm de espesor compuesta por yeso natural, fibra de vidrio y aditivos inorgánicos que le aportan alta dureza y resistencia mecánica. Al otro lado, incorpora una placa FUEGO de 13 mm con perlita y un aumento en la densidad que la hace idónea para un excelente comportamiento y resistencia frente al fuego. Reacción al fuego: EUROCLASE A1. Sistema de galces desiguales: las placas encajan entre ellas dejando una entrecalle de 3 mm por donde se inserta la pasta de juntas. Este sistema no utiliza cinta de papel. La pasta de juntas se aplica en las cavidades de las placas y una masilla elástica en los encuentros. Atornillada a cada lado de una estructura metálica de acero galvanizado formada por canales de 50 mm y montantes de 51x49x49 mm con una modulación de 600 mm entre ejes, dando un ancho total de tabique de 75 mm. Incluida parte proporcional del resto de materiales: tornillería, pasta de juntas, masilla para encuentros perimetrales, fijaciones, junta estanca, etc. Montaje según norma de instalación UNE 102043 y exigencias del CTE.","Tabique mixto formado por una placa BASIC de 13 mm de espesor compuesta por yeso natural, fibra de vidrio y aditivos inorgánicos que le aportan alta dureza y resistencia mecánica. Al otro lado, incorpora una placa RESIST de 13 mm que con mayor cantidad de fibra de vidrio y dosificación modificada, aumenta su densidad, mejorando notablemente la resistencia mecánica. Idónea para lugares con altas exigencias en cuanto a deterioro y desgaste. Reacción al fuego: EUROCLASE A1. Sistema de galces desiguales: las placas encajan entre ellas dejando una entrecalle de 3 mm por donde se inserta la pasta de juntas. Este sistema no utiliza cinta de papel. La pasta de juntas se aplica en las cavidades de las placas y una masilla elástica en los encuentros. Atornillada a cada lado de una estructura metálica de acero galvanizado formada por canales de 50 mm y montantes de 51x49x49 mm con una modulación de 600 mm entre ejes, dando un ancho total de tabique de 75 mm. Incluida parte proporcional del resto de materiales: tornillería, pasta de juntas, masilla para encuentros perimetrales, fijaciones, junta estanca, etc. Montaje según norma de instalación UNE 102043 y exigencias del CTE.","Tabique mixto formado por una placa BASIC de 13 mm de espesor compuesta por yeso natural, fibra de vidrio y aditivos inorgánicos que le aportan alta dureza y resistencia mecánica. Al otro lado, incorpora una placa HIDROPLUS de 13 mm con tratamiento hidrófugo y un aumento en su densidad, características claves para una elevada resistencia a la humedad (absorción de agua menor al 3%) y una gran resistencia mecánica. Idónea para zonas de intemperie. Reacción al fuego: EUROCLASE A1. Sistema de galces desiguales: las placas encajan entre ellas dejando una entrecalle de 3 mm por donde se inserta la pasta de juntas. Este sistema no utiliza cinta de papel. La pasta de juntas se aplica en las cavidades de las placas y una masilla elástica en los encuentros. Atornillada a cada lado de una estructura metálica de acero galvanizado formada por canales de 50 mm y montantes de 51x49x49 mm con una modulación de 600 mm entre ejes, dando un ancho total de tabique de 75 mm. Incluida parte proporcional del resto de materiales: tornillería, pasta de juntas, masilla para encuentros perimetrales, fijaciones, junta estanca, etc. Montaje según norma de instalación UNE 102043 y exigencias del CTE.","Tabique mixto formado por una placa BASIC de 13 mm de espesor compuesta por yeso natural, fibra de vidrio y aditivos inorgánicos que le aportan alta dureza y resistencia mecánica. Al otro lado, incorpora una placa SUPREM de 13 mm con tratamiento hidrófugo, perlita y un aumento en la densidad para conseguir soluciones constructivas que cumplan, altos requisitos frente al fuego y una capacidad reducida de absorción de agua. Reacción al fuego: EUROCLASE A1. Sistema de galces desiguales: las placas encajan entre ellas dejando una entrecalle de 3 mm por donde se inserta la pasta de juntas. Este sistema no utiliza cinta de papel. La pasta de juntas se aplica en las cavidades de las placas y una masilla elástica en los encuentros. Atornillada a cada lado de una estructura metálica de acero galvanizado formada por canales de 50 mm y montantes de 51x49x49 mm con una modulación de 600 mm entre ejes, dando un ancho total de tabique de 75 mm. Incluida parte proporcional del resto de materiales: tornillería, pasta de juntas, masilla para encuentros perimetrales, fijaciones, junta estanca, etc. Montaje según norma de instalación UNE 102043 y exigencias del CTE."]
[null,null,64975,"2.1.2","TABIQUE MIXTO ATT® 79/600 (49)  [15+49+15]",600,49,15,"-","Tabique mixto formado por una placa BASIC de 15 mm de espesor compuesta por yeso natural, fibra de vidrio y aditivos inorgánicos que le aportan alta dureza y resistencia mecánica. Al otro lado, incorpora una placa HIDRO de 15 mm con tratamiento hidrófugo, disminuyendo así su capacidad de absorción de agua (menor al 5%). Idónea para proteger las estancias de los efectos adversos de la humedad. Reacción al fuego: EUROCLASE A1. Sistema de galces desiguales: las placas encajan entre ellas dejando una entrecalle de 3 mm por donde se inserta la pasta de juntas. Este sistema no utiliza cinta de papel. La pasta de juntas se aplica en las cavidades de las placas y una masilla elástica en los encuentros. Atornillada a cada lado de una estructura metálica de acero galvanizado formada por canales de 50 mm y montantes de 51x49x49 mm con una modulación de 600 mm entre ejes, dando un ancho total de tabique de 79 mm. Incluida parte proporcional del resto de materiales: tornillería, pasta de juntas, masilla para encuentros perimetrales, fijaciones, junta estanca, etc. Montaje según norma de instalación UNE 102043 y exigencias del CTE.","Tabique mixto formado por una placa BASIC de 15 mm de espesor compuesta por yeso natural, fibra de vidrio y aditivos inorgánicos que le aportan alta dureza y resistencia mecánica. Al otro lado, incorpora una placa FUEGO de 15 mm con perlita y un aumento en la densidad que la hace idónea para un excelente comportamiento y resistencia frente al fuego. Reacción al fuego: EUROCLASE A1. Sistema de galces desiguales: las placas encajan entre ellas dejando una entrecalle de 3 mm por donde se inserta la pasta de juntas. Este sistema no utiliza cinta de papel. La pasta de juntas se aplica en las cavidades de las placas y una masilla elástica en los encuentros. Atornillada a cada lado de una estructura metálica de acero galvanizado formada por canales de 50 mm y montantes de 51x49x49 mm con una modulación de 600 mm entre ejes, dando un ancho total de tabique de 79 mm. Incluida parte proporcional del resto de materiales: tornillería, pasta de juntas, masilla para encuentros perimetrales, fijaciones, junta estanca, etc. Montaje según norma de instalación UNE 102043 y exigencias del CTE.","Tabique mixto formado por una placa BASIC de 15 mm de espesor compuesta por yeso natural, fibra de vidrio y aditivos inorgánicos que le aportan alta dureza y resistencia mecánica. Al otro lado, incorpora una placa RESIST de 15 mm que con mayor cantidad de fibra de vidrio y dosificación modificada, aumenta su densidad, mejorando notablemente la resistencia mecánica. Idónea para lugares con altas exigencias en cuanto a deterioro y desgaste. Reacción al fuego: EUROCLASE A1. Sistema de galces desiguales: las placas encajan entre ellas dejando una entrecalle de 3 mm por donde se inserta la pasta de juntas. Este sistema no utiliza cinta de papel. La pasta de juntas se aplica en las cavidades de las placas y una masilla elástica en los encuentros. Atornillada a cada lado de una estructura metálica de acero galvanizado formada por canales de 50 mm y montantes de 51x49x49 mm con una modulación de 600 mm entre ejes, dando un ancho total de tabique de 79 mm. Incluida parte proporcional del resto de materiales: tornillería, pasta de juntas, masilla para encuentros perimetrales, fijaciones, junta estanca, etc. Montaje según norma de instalación UNE 102043 y exigencias del CTE.","Tabique mixto formado por una placa BASIC de 15 mm de espesor compuesta por yeso natural, fibra de vidrio y aditivos inorgánicos que le aportan alta dureza y resistencia mecánica. Al otro lado, incorpora una placa HIDROPLUS de 15 mm con tratamiento hidrófugo y un aumento en su densidad, características claves para una elevada resistencia a la humedad (absorción de agua menor al 3%) y una gran resistencia mecánica. Idónea para zonas de intemperie. Reacción al fuego: EUROCLASE A1. Sistema de galces desiguales: las placas encajan entre ellas dejando una entrecalle de 3 mm por donde se inserta la pasta de juntas. Este sistema no utiliza cinta de papel. La pasta de juntas se aplica en las cavidades de las placas y una masilla elástica en los encuentros. Atornillada a cada lado de una estructura metálica de acero galvanizado formada por canales de 50 mm y montantes de 51x49x49 mm con una modulación de 600 mm entre ejes, dando un ancho total de tabique de 79 mm. Incluida parte proporcional del resto de materiales: tornillería, pasta de juntas, masilla para encuentros perimetrales, fijaciones, junta estanca, etc. Montaje según norma de instalación UNE 102043 y exigencias del CTE.","Tabique mixto formado por una placa BASIC de 15 mm de espesor compuesta por yeso natural, fibra de vidrio y aditivos inorgánicos que le aportan alta dureza y resistencia mecánica. Al otro lado, incorpora una placa SUPREM de 15 mm con tratamiento hidrófugo, perlita y un aumento en la densidad para conseguir soluciones constructivas que cumplan, altos requisitos frente al fuego y una capacidad reducida de absorción de agua. Reacción al fuego: EUROCLASE A1. Sistema de galces desiguales: las placas encajan entre ellas dejando una entrecalle de 3 mm por donde se inserta la pasta de juntas. Este sistema no utiliza cinta de papel. La pasta de juntas se aplica en las cavidades de las placas y una masilla elástica en los encuentros. Atornillada a cada lado de una estructura metálica de acero galvanizado formada por canales de 50 mm y montantes de 51x49x49 mm con una modulación de 600 mm entre ejes, dando un ancho total de tabique de 79 mm. Incluida parte proporcional del resto de materiales: tornillería, pasta de juntas, masilla para encuentros perimetrales, fijaciones, junta estanca, etc. Montaje según norma de instalación UNE 102043 y exigencias del CTE."]
[null,null,65000,"2.1.3","TABIQUE MIXTO ATT® 89/600 (49)  [20+49+20]",600,49,20,"-","Tabique mixto formado por una placa BASIC de 20 mm de espesor compuesta por yeso natural, fibra de vidrio y aditivos inorgánicos que le aportan alta dureza y resistencia mecánica. Al otro lado, incorpora una placa HIDRO de 20 mm con tratamiento hidrófugo, disminuyendo así su capacidad de absorción de agua (menor al 5%). Idónea para proteger las estancias de los efectos adversos de la humedad. Reacción al fuego: EUROCLASE A1. Sistema de galces desiguales: las placas encajan entre ellas dejando una entrecalle de 3 mm por donde se inserta la pasta de juntas. Este sistema no utiliza cinta de papel. La pasta de juntas se aplica en las cavidades de las placas y una masilla elástica en los encuentros. Atornillada a cada lado de una estructura metálica de acero galvanizado formada por canales de 50 mm y montantes de 51x49x49 mm con una modulación de 600 mm entre ejes, dando un ancho total de tabique de 89 mm. Incluida parte proporcional del resto de materiales: tornillería, pasta de juntas, masilla para encuentros perimetrales, fijaciones, junta estanca, etc. Montaje según norma de instalación UNE 102043 y exigencias del CTE.","Tabique mixto formado por una placa BASIC de 20 mm de espesor compuesta por yeso natural, fibra de vidrio y aditivos inorgánicos que le aportan alta dureza y resistencia mecánica. Al otro lado, incorpora una placa FUEGO de 20 mm con perlita y un aumento en la densidad que la hace idónea para un excelente comportamiento y resistencia frente al fuego. Reacción al fuego: EUROCLASE A1. Sistema de galces desiguales: las placas encajan entre ellas dejando una entrecalle de 3 mm por donde se inserta la pasta de juntas. Este sistema no utiliza cinta de papel. La pasta de juntas se aplica en las cavidades de las placas y una masilla elástica en los encuentros. Atornillada a cada lado de una estructura metálica de acero galvanizado formada por canales de 50 mm y montantes de 51x49x49 mm con una modulación de 600 mm entre ejes, dando un ancho total de tabique de 89 mm. Incluida parte proporcional del resto de materiales: tornillería, pasta de juntas, masilla para encuentros perimetrales, fijaciones, junta estanca, etc. Montaje según norma de instalación UNE 102043 y exigencias del CTE.","Tabique mixto formado por una placa BASIC de 20 mm de espesor compuesta por yeso natural, fibra de vidrio y aditivos inorgánicos que le aportan alta dureza y resistencia mecánica. Al otro lado, incorpora una placa RESIST de 20 mm que con mayor cantidad de fibra de vidrio y dosificación modificada, aumenta su densidad, mejorando notablemente la resistencia mecánica. Idónea para lugares con altas exigencias en cuanto a deterioro y desgaste. Reacción al fuego: EUROCLASE A1. Sistema de galces desiguales: las placas encajan entre ellas dejando una entrecalle de 3 mm por donde se inserta la pasta de juntas. Este sistema no utiliza cinta de papel. La pasta de juntas se aplica en las cavidades de las placas y una masilla elástica en los encuentros. Atornillada a cada lado de una estructura metálica de acero galvanizado formada por canales de 50 mm y montantes de 51x49x49 mm con una modulación de 600 mm entre ejes, dando un ancho total de tabique de 89 mm. Incluida parte proporcional del resto de materiales: tornillería, pasta de juntas, masilla para encuentros perimetrales, fijaciones, junta estanca, etc. Montaje según norma de instalación UNE 102043 y exigencias del CTE.","Tabique mixto formado por una placa BASIC de 20 mm de espesor compuesta por yeso natural, fibra de vidrio y aditivos inorgánicos que le aportan alta dureza y resistencia mecánica. Al otro lado, incorpora una placa HIDROPLUS de 20 mm con tratamiento hidrófugo y un aumento en su densidad, características claves para una elevada resistencia a la humedad (absorción de agua menor al 3%) y una gran resistencia mecánica. Idónea para zonas de intemperie. Reacción al fuego: EUROCLASE A1. Sistema de galces desiguales: las placas encajan entre ellas dejando una entrecalle de 3 mm por donde se inserta la pasta de juntas. Este sistema no utiliza cinta de papel. La pasta de juntas se aplica en las cavidades de las placas y una masilla elástica en los encuentros. Atornillada a cada lado de una estructura metálica de acero galvanizado formada por canales de 50 mm y montantes de 51x49x49 mm con una modulación de 600 mm entre ejes, dando un ancho total de tabique de 89 mm. Incluida parte proporcional del resto de materiales: tornillería, pasta de juntas, masilla para encuentros perimetrales, fijaciones, junta estanca, etc. Montaje según norma de instalación UNE 102043 y exigencias del CTE.","Tabique mixto formado por una placa BASIC de 20 mm de espesor compuesta por yeso natural, fibra de vidrio y aditivos inorgánicos que le aportan alta dureza y resistencia mecánica. Al otro lado, incorpora una placa SUPREM de 20 mm con tratamiento hidrófugo, perlita y un aumento en la densidad para conseguir soluciones constructivas que cumplan, altos requisitos frente al fuego y una capacidad reducida de absorción de agua. Reacción al fuego: EUROCLASE A1. Sistema de galces desiguales: las placas encajan entre ellas dejando una entrecalle de 3 mm por donde se inserta la pasta de juntas. Este sistema no utiliza cinta de papel. La pasta de juntas se aplica en las cavidades de las placas y una masilla elástica en los encuentros. Atornillada a cada lado de una estructura metálica de acero galvanizado formada por canales de 50 mm y montantes de 51x49x49 mm con una modulación de 600 mm entre ejes, dando un ancho total de tabique de 89 mm. Incluida parte proporcional del resto de materiales: tornillería, pasta de juntas, masilla para encuentros perimetrales, fijaciones, junta estanca, etc. Montaje según norma de instalación UNE 102043 y exigencias del CTE."]
[null,null,67465,"2.1.4","TABIQUE MIXTO ATT® 100/600 (74)  [13+74+13]",600,74,13,"-","Tabique mixto formado por una placa BASIC de 13 mm de espesor compuesta por yeso natural, fibra de vidrio y aditivos inorgánicos que le aportan alta dureza y resistencia mecánica. Al otro lado, incorpora una placa HIDRO de 13 mm con tratamiento hidrófugo, disminuyendo así su capacidad de absorción de agua (menor al 5%). Idónea para proteger las estancias de los efectos adversos de la humedad. Reacción al fuego: EUROCLASE A1. Sistema de galces desiguales: las placas encajan entre ellas dejando una entrecalle de 3 mm por donde se inserta la pasta de juntas. Este sistema no utiliza cinta de papel. La pasta de juntas se aplica en las cavidades de las placas y una masilla elástica en los encuentros. Atornillada a cada lado de una estructura metálica de acero galvanizado formada por canales de 50 mm y montantes de 51x74x49 mm con una modulación de 600 mm entre ejes, dando un ancho total de tabique de 100 mm. Incluida parte proporcional del resto de materiales: tornillería, pasta de juntas, masilla para encuentros perimetrales, fijaciones, junta estanca, etc. Montaje según norma de instalación UNE 102043 y exigencias del CTE.","Tabique mixto formado por una placa BASIC de 13 mm de espesor compuesta por yeso natural, fibra de vidrio y aditivos inorgánicos que le aportan alta dureza y resistencia mecánica. Al otro lado, incorpora una placa FUEGO de 13 mm con perlita y un aumento en la densidad que la hace idónea para un excelente comportamiento y resistencia frente al fuego. Reacción al fuego: EUROCLASE A1. Sistema de galces desiguales: las placas encajan entre ellas dejando una entrecalle de 3 mm por donde se inserta la pasta de juntas. Este sistema no utiliza cinta de papel. La pasta de juntas se aplica en las cavidades de las placas y una masilla elástica en los encuentros. Atornillada a cada lado de una estructura metálica de acero galvanizado formada por canales de 50 mm y montantes de 51x74x49 mm con una modulación de 600 mm entre ejes, dando un ancho total de tabique de 100 mm. Incluida parte proporcional del resto de materiales: tornillería, pasta de juntas, masilla para encuentros perimetrales, fijaciones, junta estanca, etc. Montaje según norma de instalación UNE 102043 y exigencias del CTE.","Tabique mixto formado por una placa BASIC de 13 mm de espesor compuesta por yeso natural, fibra de vidrio y aditivos inorgánicos que le aportan alta dureza y resistencia mecánica. Al otro lado, incorpora una placa RESIST de 13 mm que con mayor cantidad de fibra de vidrio y dosificación modificada, aumenta su densidad, mejorando notablemente la resistencia mecánica. Idónea para lugares con altas exigencias en cuanto a deterioro y desgaste. Reacción al fuego: EUROCLASE A1. Sistema de galces desiguales: las placas encajan entre ellas dejando una entrecalle de 3 mm por donde se inserta la pasta de juntas. Este sistema no utiliza cinta de papel. La pasta de juntas se aplica en las cavidades de las placas y una masilla elástica en los encuentros. Atornillada a cada lado de una estructura metálica de acero galvanizado formada por canales de 50 mm y montantes de 51x74x49 mm con una modulación de 600 mm entre ejes, dando un ancho total de tabique de 100 mm. Incluida parte proporcional del resto de materiales: tornillería, pasta de juntas, masilla para encuentros perimetrales, fijaciones, junta estanca, etc. Montaje según norma de instalación UNE 102043 y exigencias del CTE.","Tabique mixto formado por una placa BASIC de 13 mm de espesor compuesta por yeso natural, fibra de vidrio y aditivos inorgánicos que le aportan alta dureza y resistencia mecánica. Al otro lado, incorpora una placa HIDROPLUS de 13 mm con tratamiento hidrófugo y un aumento en su densidad, características claves para una elevada resistencia a la humedad (absorción de agua menor al 3%) y una gran resistencia mecánica. Idónea para zonas de intemperie. Reacción al fuego: EUROCLASE A1. Sistema de galces desiguales: las placas encajan entre ellas dejando una entrecalle de 3 mm por donde se inserta la pasta de juntas. Este sistema no utiliza cinta de papel. La pasta de juntas se aplica en las cavidades de las placas y una masilla elástica en los encuentros. Atornillada a cada lado de una estructura metálica de acero galvanizado formada por canales de 50 mm y montantes de 51x74x49 mm con una modulación de 600 mm entre ejes, dando un ancho total de tabique de 100 mm. Incluida parte proporcional del resto de materiales: tornillería, pasta de juntas, masilla para encuentros perimetrales, fijaciones, junta estanca, etc. Montaje según norma de instalación UNE 102043 y exigencias del CTE.","Tabique mixto formado por una placa BASIC de 13 mm de espesor compuesta por yeso natural, fibra de vidrio y aditivos inorgánicos que le aportan alta dureza y resistencia mecánica. Al otro lado, incorpora una placa SUPREM de 13 mm con tratamiento hidrófugo, perlita y un aumento en la densidad para conseguir soluciones constructivas que cumplan, altos requisitos frente al fuego y una capacidad reducida de absorción de agua. Reacción al fuego: EUROCLASE A1. Sistema de galces desiguales: las placas encajan entre ellas dejando una entrecalle de 3 mm por donde se inserta la pasta de juntas. Este sistema no utiliza cinta de papel. La pasta de juntas se aplica en las cavidades de las placas y una masilla elástica en los encuentros. Atornillada a cada lado de una estructura metálica de acero galvanizado formada por canales de 50 mm y montantes de 51x74x49 mm con una modulación de 600 mm entre ejes, dando un ancho total de tabique de 100 mm. Incluida parte proporcional del resto de materiales: tornillería, pasta de juntas, masilla para encuentros perimetrales, fijaciones, junta estanca, etc. Montaje según norma de instalación UNE 102043 y exigencias del CTE."]
[null,null,67475,"2.1.5","TABIQUE MIXTO ATT® 104/600 (74)  [15+74+15]",600,74,15,"-","Tabique mixto formado por una placa BASIC de 15 mm de espesor compuesta por yeso natural, fibra de vidrio y aditivos inorgánicos que le aportan alta dureza y resistencia mecánica. Al otro lado, incorpora una placa HIDRO de 15 mm con tratamiento hidrófugo, disminuyendo así su capacidad de absorción de agua (menor al 5%). Idónea para proteger las estancias de los efectos adversos de la humedad. Reacción al fuego: EUROCLASE A1. Sistema de galces desiguales: las placas encajan entre ellas dejando una entrecalle de 3 mm por donde se inserta la pasta de juntas. Este sistema no utiliza cinta de papel. La pasta de juntas se aplica en las cavidades de las placas y una masilla elástica en los encuentros. Atornillada a cada lado de una estructura metálica de acero galvanizado formada por canales de 50 mm y montantes de 51x74x49 mm con una modulación de 600 mm entre ejes, dando un ancho total de tabique de 104 mm. Incluida parte proporcional del resto de materiales: tornillería, pasta de juntas, masilla para encuentros perimetrales, fijaciones, junta estanca, etc. Montaje según norma de instalación UNE 102043 y exigencias del CTE.","Tabique mixto formado por una placa BASIC de 15 mm de espesor compuesta por yeso natural, fibra de vidrio y aditivos inorgánicos que le aportan alta dureza y resistencia mecánica. Al otro lado, incorpora una placa FUEGO de 15 mm con perlita y un aumento en la densidad que la hace idónea para un excelente comportamiento y resistencia frente al fuego. Reacción al fuego: EUROCLASE A1. Sistema de galces desiguales: las placas encajan entre ellas dejando una entrecalle de 3 mm por donde se inserta la pasta de juntas. Este sistema no utiliza cinta de papel. La pasta de juntas se aplica en las cavidades de las placas y una masilla elástica en los encuentros. Atornillada a cada lado de una estructura metálica de acero galvanizado formada por canales de 50 mm y montantes de 51x74x49 mm con una modulación de 600 mm entre ejes, dando un ancho total de tabique de 104 mm. Incluida parte proporcional del resto de materiales: tornillería, pasta de juntas, masilla para encuentros perimetrales, fijaciones, junta estanca, etc. Montaje según norma de instalación UNE 102043 y exigencias del CTE.","Tabique mixto formado por una placa BASIC de 15 mm de espesor compuesta por yeso natural, fibra de vidrio y aditivos inorgánicos que le aportan alta dureza y resistencia mecánica. Al otro lado, incorpora una placa RESIST de 15 mm que con mayor cantidad de fibra de vidrio y dosificación modificada, aumenta su densidad, mejorando notablemente la resistencia mecánica. Idónea para lugares con altas exigencias en cuanto a deterioro y desgaste. Reacción al fuego: EUROCLASE A1. Sistema de galces desiguales: las placas encajan entre ellas dejando una entrecalle de 3 mm por donde se inserta la pasta de juntas. Este sistema no utiliza cinta de papel. La pasta de juntas se aplica en las cavidades de las placas y una masilla elástica en los encuentros. Atornillada a cada lado de una estructura metálica de acero galvanizado formada por canales de 50 mm y montantes de 51x74x49 mm con una modulación de 600 mm entre ejes, dando un ancho total de tabique de 104 mm. Incluida parte proporcional del resto de materiales: tornillería, pasta de juntas, masilla para encuentros perimetrales, fijaciones, junta estanca, etc. Montaje según norma de instalación UNE 102043 y exigencias del CTE.","Tabique mixto formado por una placa BASIC de 15 mm de espesor compuesta por yeso natural, fibra de vidrio y aditivos inorgánicos que le aportan alta dureza y resistencia mecánica. Al otro lado, incorpora una placa HIDROPLUS de 15 mm con tratamiento hidrófugo y un aumento en su densidad, características claves para una elevada resistencia a la humedad (absorción de agua menor al 3%) y una gran resistencia mecánica. Idónea para zonas de intemperie. Reacción al fuego: EUROCLASE A1. Sistema de galces desiguales: las placas encajan entre ellas dejando una entrecalle de 3 mm por donde se inserta la pasta de juntas. Este sistema no utiliza cinta de papel. La pasta de juntas se aplica en las cavidades de las placas y una masilla elástica en los encuentros. Atornillada a cada lado de una estructura metálica de acero galvanizado formada por canales de 50 mm y montantes de 51x74x49 mm con una modulación de 600 mm entre ejes, dando un ancho total de tabique de 104 mm. Incluida parte proporcional del resto de materiales: tornillería, pasta de juntas, masilla para encuentros perimetrales, fijaciones, junta estanca, etc. Montaje según norma de instalación UNE 102043 y exigencias del CTE.","Tabique mixto formado por una placa BASIC de 15 mm de espesor compuesta por yeso natural, fibra de vidrio y aditivos inorgánicos que le aportan alta dureza y resistencia mecánica. Al otro lado, incorpora una placa SUPREM de 15 mm con tratamiento hidrófugo, perlita y un aumento en la densidad para conseguir soluciones constructivas que cumplan, altos requisitos frente al fuego y una capacidad reducida de absorción de agua. Reacción al fuego: EUROCLASE A1. Sistema de galces desiguales: las placas encajan entre ellas dejando una entrecalle de 3 mm por donde se inserta la pasta de juntas. Este sistema no utiliza cinta de papel. La pasta de juntas se aplica en las cavidades de las placas y una masilla elástica en los encuentros. Atornillada a cada lado de una estructura metálica de acero galvanizado formada por canales de 50 mm y montantes de 51x74x49 mm con una modulación de 600 mm entre ejes, dando un ancho total de tabique de 104 mm. Incluida parte proporcional del resto de materiales: tornillería, pasta de juntas, masilla para encuentros perimetrales, fijaciones, junta estanca, etc. Montaje según norma de instalación UNE 102043 y exigencias del CTE."]
[null,null,67500,"2.1.6","TABIQUE MIXTO ATT® 114/600 (74)  [20+74+20]",600,74,20,"-","Tabique mixto formado por una placa BASIC de 20 mm de espesor compuesta por yeso natural, fibra de vidrio y aditivos inorgánicos que le aportan alta dureza y resistencia mecánica. Al otro lado, incorpora una placa HIDRO de 20 mm con tratamiento hidrófugo, disminuyendo así su capacidad de absorción de agua (menor al 5%). Idónea para proteger las estancias de los efectos adversos de la humedad. Reacción al fuego: EUROCLASE A1. Sistema de galces desiguales: las placas encajan entre ellas dejando una entrecalle de 3 mm por donde se inserta la pasta de juntas. Este sistema no utiliza cinta de papel. La pasta de juntas se aplica en las cavidades de las placas y una masilla elástica en los encuentros. Atornillada a cada lado de una estructura metálica de acero galvanizado formada por canales de 50 mm y montantes de 51x74x49 mm con una modulación de 600 mm entre ejes, dando un ancho total de tabique de 114 mm. Incluida parte proporcional del resto de materiales: tornillería, pasta de juntas, masilla para encuentros perimetrales, fijaciones, junta estanca, etc. Montaje según norma de instalación UNE 102043 y exigencias del CTE.","Tabique mixto formado por una placa BASIC de 20 mm de espesor compuesta por yeso natural, fibra de vidrio y aditivos inorgánicos que le aportan alta dureza y resistencia mecánica. Al otro lado, incorpora una placa FUEGO de 20 mm con perlita y un aumento en la densidad que la hace idónea para un excelente comportamiento y resistencia frente al fuego. Reacción al fuego: EUROCLASE A1. Sistema de galces desiguales: las placas encajan entre ellas dejando una entrecalle de 3 mm por donde se inserta la pasta de juntas. Este sistema no utiliza cinta de papel. La pasta de juntas se aplica en las cavidades de las placas y una masilla elástica en los encuentros. Atornillada a cada lado de una estructura metálica de acero galvanizado formada por canales de 50 mm y montantes de 51x74x49 mm con una modulación de 600 mm entre ejes, dando un ancho total de tabique de 114 mm. Incluida parte proporcional del resto de materiales: tornillería, pasta de juntas, masilla para encuentros perimetrales, fijaciones, junta estanca, etc. Montaje según norma de instalación UNE 102043 y exigencias del CTE.","Tabique mixto formado por una placa BASIC de 20 mm de espesor compuesta por yeso natural, fibra de vidrio y aditivos inorgánicos que le aportan alta dureza y resistencia mecánica. Al otro lado, incorpora una placa RESIST de 20 mm que con mayor cantidad de fibra de vidrio y dosificación modificada, aumenta su densidad, mejorando notablemente la resistencia mecánica. Idónea para lugares con altas exigencias en cuanto a deterioro y desgaste. Reacción al fuego: EUROCLASE A1. Sistema de galces desiguales: las placas encajan entre ellas dejando una entrecalle de 3 mm por donde se inserta la pasta de juntas. Este sistema no utiliza cinta de papel. La pasta de juntas se aplica en las cavidades de las placas y una masilla elástica en los encuentros. Atornillada a cada lado de una estructura metálica de acero galvanizado formada por canales de 50 mm y montantes de 51x74x49 mm con una modulación de 600 mm entre ejes, dando un ancho total de tabique de 114 mm. Incluida parte proporcional del resto de materiales: tornillería, pasta de juntas, masilla para encuentros perimetrales, fijaciones, junta estanca, etc. Montaje según norma de instalación UNE 102043 y exigencias del CTE.","Tabique mixto formado por una placa BASIC de 20 mm de espesor compuesta por yeso natural, fibra de vidrio y aditivos inorgánicos que le aportan alta dureza y resistencia mecánica. Al otro lado, incorpora una placa HIDROPLUS de 20 mm con tratamiento hidrófugo y un aumento en su densidad, características claves para una elevada resistencia a la humedad (absorción de agua menor al 3%) y una gran resistencia mecánica. Idónea para zonas de intemperie. Reacción al fuego: EUROCLASE A1. Sistema de galces desiguales: las placas encajan entre ellas dejando una entrecalle de 3 mm por donde se inserta la pasta de juntas. Este sistema no utiliza cinta de papel. La pasta de juntas se aplica en las cavidades de las placas y una masilla elástica en los encuentros. Atornillada a cada lado de una estructura metálica de acero galvanizado formada por canales de 50 mm y montantes de 51x74x49 mm con una modulación de 600 mm entre ejes, dando un ancho total de tabique de 114 mm. Incluida parte proporcional del resto de materiales: tornillería, pasta de juntas, masilla para encuentros perimetrales, fijaciones, junta estanca, etc. Montaje según norma de instalación UNE 102043 y exigencias del CTE.","Tabique mixto formado por una placa BASIC de 20 mm de espesor compuesta por yeso natural, fibra de vidrio y aditivos inorgánicos que le aportan alta dureza y resistencia mecánica. Al otro lado, incorpora una placa SUPREM de 20 mm con tratamiento hidrófugo, perlita y un aumento en la densidad para conseguir soluciones constructivas que cumplan, altos requisitos frente al fuego y una capacidad reducida de absorción de agua. Reacción al fuego: EUROCLASE A1. Sistema de galces desiguales: las placas encajan entre ellas dejando una entrecalle de 3 mm por donde se inserta la pasta de juntas. Este sistema no utiliza cinta de papel. La pasta de juntas se aplica en las cavidades de las placas y una masilla elástica en los encuentros. Atornillada a cada lado de una estructura metálica de acero galvanizado formada por canales de 50 mm y montantes de 51x74x49 mm con una modulación de 600 mm entre ejes, dando un ancho total de tabique de 114 mm. Incluida parte proporcional del resto de materiales: tornillería, pasta de juntas, masilla para encuentros perimetrales, fijaciones, junta estanca, etc. Montaje según norma de instalación UNE 102043 y exigencias del CTE."]
[null,null,69965,"2.1.7","TABIQUE MIXTO ATT® 125/600 (99)  [13+99+13]",600,99,13,"-","Tabique mixto formado por una placa BASIC de 13 mm de espesor compuesta por yeso natural, fibra de vidrio y aditivos inorgánicos que le aportan alta dureza y resistencia mecánica. Al otro lado, incorpora una placa HIDRO de 13 mm con tratamiento hidrófugo, disminuyendo así su capacidad de absorción de agua (menor al 5%). Idónea para proteger las estancias de los efectos adversos de la humedad. Reacción al fuego: EUROCLASE A1. Sistema de galces desiguales: las placas encajan entre ellas dejando una entrecalle de 3 mm por donde se inserta la pasta de juntas. Este sistema no utiliza cinta de papel. La pasta de juntas se aplica en las cavidades de las placas y una masilla elástica en los encuentros. Atornillada a cada lado de una estructura metálica de acero galvanizado formada por canales de 50 mm y montantes de 51x99x49 mm con una modulación de 600 mm entre ejes, dando un ancho total de tabique de 125 mm. Incluida parte proporcional del resto de materiales: tornillería, pasta de juntas, masilla para encuentros perimetrales, fijaciones, junta estanca, etc. Montaje según norma de instalación UNE 102043 y exigencias del CTE.","Tabique mixto formado por una placa BASIC de 13 mm de espesor compuesta por yeso natural, fibra de vidrio y aditivos inorgánicos que le aportan alta dureza y resistencia mecánica. Al otro lado, incorpora una placa FUEGO de 13 mm con perlita y un aumento en la densidad que la hace idónea para un excelente comportamiento y resistencia frente al fuego. Reacción al fuego: EUROCLASE A1. Sistema de galces desiguales: las placas encajan entre ellas dejando una entrecalle de 3 mm por donde se inserta la pasta de juntas. Este sistema no utiliza cinta de papel. La pasta de juntas se aplica en las cavidades de las placas y una masilla elástica en los encuentros. Atornillada a cada lado de una estructura metálica de acero galvanizado formada por canales de 50 mm y montantes de 51x99x49 mm con una modulación de 600 mm entre ejes, dando un ancho total de tabique de 125 mm. Incluida parte proporcional del resto de materiales: tornillería, pasta de juntas, masilla para encuentros perimetrales, fijaciones, junta estanca, etc. Montaje según norma de instalación UNE 102043 y exigencias del CTE.","Tabique mixto formado por una placa BASIC de 13 mm de espesor compuesta por yeso natural, fibra de vidrio y aditivos inorgánicos que le aportan alta dureza y resistencia mecánica. Al otro lado, incorpora una placa RESIST de 13 mm que con mayor cantidad de fibra de vidrio y dosificación modificada, aumenta su densidad, mejorando notablemente la resistencia mecánica. Idónea para lugares con altas exigencias en cuanto a deterioro y desgaste. Reacción al fuego: EUROCLASE A1. Sistema de galces desiguales: las placas encajan entre ellas dejando una entrecalle de 3 mm por donde se inserta la pasta de juntas. Este sistema no utiliza cinta de papel. La pasta de juntas se aplica en las cavidades de las placas y una masilla elástica en los encuentros. Atornillada a cada lado de una estructura metálica de acero galvanizado formada por canales de 50 mm y montantes de 51x99x49 mm con una modulación de 600 mm entre ejes, dando un ancho total de tabique de 125 mm. Incluida parte proporcional del resto de materiales: tornillería, pasta de juntas, masilla para encuentros perimetrales, fijaciones, junta estanca, etc. Montaje según norma de instalación UNE 102043 y exigencias del CTE.","Tabique mixto formado por una placa BASIC de 13 mm de espesor compuesta por yeso natural, fibra de vidrio y aditivos inorgánicos que le aportan alta dureza y resistencia mecánica. Al otro lado, incorpora una placa HIDROPLUS de 13 mm con tratamiento hidrófugo y un aumento en su densidad, características claves para una elevada resistencia a la humedad (absorción de agua menor al 3%) y una gran resistencia mecánica. Idónea para zonas de intemperie. Reacción al fuego: EUROCLASE A1. Sistema de galces desiguales: las placas encajan entre ellas dejando una entrecalle de 3 mm por donde se inserta la pasta de juntas. Este sistema no utiliza cinta de papel. La pasta de juntas se aplica en las cavidades de las placas y una masilla elástica en los encuentros. Atornillada a cada lado de una estructura metálica de acero galvanizado formada por canales de 50 mm y montantes de 51x99x49 mm con una modulación de 600 mm entre ejes, dando un ancho total de tabique de 125 mm. Incluida parte proporcional del resto de materiales: tornillería, pasta de juntas, masilla para encuentros perimetrales, fijaciones, junta estanca, etc. Montaje según norma de instalación UNE 102043 y exigencias del CTE.","Tabique mixto formado por una placa BASIC de 13 mm de espesor compuesta por yeso natural, fibra de vidrio y aditivos inorgánicos que le aportan alta dureza y resistencia mecánica. Al otro lado, incorpora una placa SUPREM de 13 mm con tratamiento hidrófugo, perlita y un aumento en la densidad para conseguir soluciones constructivas que cumplan, altos requisitos frente al fuego y una capacidad reducida de absorción de agua. Reacción al fuego: EUROCLASE A1. Sistema de galces desiguales: las placas encajan entre ellas dejando una entrecalle de 3 mm por donde se inserta la pasta de juntas. Este sistema no utiliza cinta de papel. La pasta de juntas se aplica en las cavidades de las placas y una masilla elástica en los encuentros. Atornillada a cada lado de una estructura metálica de acero galvanizado formada por canales de 50 mm y montantes de 51x99x49 mm con una modulación de 600 mm entre ejes, dando un ancho total de tabique de 125 mm. Incluida parte proporcional del resto de materiales: tornillería, pasta de juntas, masilla para encuentros perimetrales, fijaciones, junta estanca, etc. Montaje según norma de instalación UNE 102043 y exigencias del CTE."]
[null,null,69975,"2.1.8","TABIQUE MIXTO ATT® 129/600 (99)  [15+99+15]",600,99,15,"-","Tabique mixto formado por una placa BASIC de 15 mm de espesor compuesta por yeso natural, fibra de vidrio y aditivos inorgánicos que le aportan alta dureza y resistencia mecánica. Al otro lado, incorpora una placa HIDRO de 15 mm con tratamiento hidrófugo, disminuyendo así su capacidad de absorción de agua (menor al 5%). Idónea para proteger las estancias de los efectos adversos de la humedad. Reacción al fuego: EUROCLASE A1. Sistema de galces desiguales: las placas encajan entre ellas dejando una entrecalle de 3 mm por donde se inserta la pasta de juntas. Este sistema no utiliza cinta de papel. La pasta de juntas se aplica en las cavidades de las placas y una masilla elástica en los encuentros. Atornillada a cada lado de una estructura metálica de acero galvanizado formada por canales de 50 mm y montantes de 51x99x49 mm con una modulación de 600 mm entre ejes, dando un ancho total de tabique de 129 mm. Incluida parte proporcional del resto de materiales: tornillería, pasta de juntas, masilla para encuentros perimetrales, fijaciones, junta estanca, etc. Montaje según norma de instalación UNE 102043 y exigencias del CTE.","Tabique mixto formado por una placa BASIC de 15 mm de espesor compuesta por yeso natural, fibra de vidrio y aditivos inorgánicos que le aportan alta dureza y resistencia mecánica. Al otro lado, incorpora una placa FUEGO de 15 mm con perlita y un aumento en la densidad que la hace idónea para un excelente comportamiento y resistencia frente al fuego. Reacción al fuego: EUROCLASE A1. Sistema de galces desiguales: las placas encajan entre ellas dejando una entrecalle de 3 mm por donde se inserta la pasta de juntas. Este sistema no utiliza cinta de papel. La pasta de juntas se aplica en las cavidades de las placas y una masilla elástica en los encuentros. Atornillada a cada lado de una estructura metálica de acero galvanizado formada por canales de 50 mm y montantes de 51x99x49 mm con una modulación de 600 mm entre ejes, dando un ancho total de tabique de 129 mm. Incluida parte proporcional del resto de materiales: tornillería, pasta de juntas, masilla para encuentros perimetrales, fijaciones, junta estanca, etc. Montaje según norma de instalación UNE 102043 y exigencias del CTE.","Tabique mixto formado por una placa BASIC de 15 mm de espesor compuesta por yeso natural, fibra de vidrio y aditivos inorgánicos que le aportan alta dureza y resistencia mecánica. Al otro lado, incorpora una placa RESIST de 15 mm que con mayor cantidad de fibra de vidrio y dosificación modificada, aumenta su densidad, mejorando notablemente la resistencia mecánica. Idónea para lugares con altas exigencias en cuanto a deterioro y desgaste. Reacción al fuego: EUROCLASE A1. Sistema de galces desiguales: las placas encajan entre ellas dejando una entrecalle de 3 mm por donde se inserta la pasta de juntas. Este sistema no utiliza cinta de papel. La pasta de juntas se aplica en las cavidades de las placas y una masilla elástica en los encuentros. Atornillada a cada lado de una estructura metálica de acero galvanizado formada por canales de 50 mm y montantes de 51x99x49 mm con una modulación de 600 mm entre ejes, dando un ancho total de tabique de 129 mm. Incluida parte proporcional del resto de materiales: tornillería, pasta de juntas, masilla para encuentros perimetrales, fijaciones, junta estanca, etc. Montaje según norma de instalación UNE 102043 y exigencias del CTE.","Tabique mixto formado por una placa BASIC de 15 mm de espesor compuesta por yeso natural, fibra de vidrio y aditivos inorgánicos que le aportan alta dureza y resistencia mecánica. Al otro lado, incorpora una placa HIDROPLUS de 15 mm con tratamiento hidrófugo y un aumento en su densidad, características claves para una elevada resistencia a la humedad (absorción de agua menor al 3%) y una gran resistencia mecánica. Idónea para zonas de intemperie. Reacción al fuego: EUROCLASE A1. Sistema de galces desiguales: las placas encajan entre ellas dejando una entrecalle de 3 mm por donde se inserta la pasta de juntas. Este sistema no utiliza cinta de papel. La pasta de juntas se aplica en las cavidades de las placas y una masilla elástica en los encuentros. Atornillada a cada lado de una estructura metálica de acero galvanizado formada por canales de 50 mm y montantes de 51x99x49 mm con una modulación de 600 mm entre ejes, dando un ancho total de tabique de 129 mm. Incluida parte proporcional del resto de materiales: tornillería, pasta de juntas, masilla para encuentros perimetrales, fijaciones, junta estanca, etc. Montaje según norma de instalación UNE 102043 y exigencias del CTE.","Tabique mixto formado por una placa BASIC de 15 mm de espesor compuesta por yeso natural, fibra de vidrio y aditivos inorgánicos que le aportan alta dureza y resistencia mecánica. Al otro lado, incorpora una placa SUPREM de 15 mm con tratamiento hidrófugo, perlita y un aumento en la densidad para conseguir soluciones constructivas que cumplan, altos requisitos frente al fuego y una capacidad reducida de absorción de agua. Reacción al fuego: EUROCLASE A1. Sistema de galces desiguales: las placas encajan entre ellas dejando una entrecalle de 3 mm por donde se inserta la pasta de juntas. Este sistema no utiliza cinta de papel. La pasta de juntas se aplica en las cavidades de las placas y una masilla elástica en los encuentros. Atornillada a cada lado de una estructura metálica de acero galvanizado formada por canales de 50 mm y montantes de 51x99x49 mm con una modulación de 600 mm entre ejes, dando un ancho total de tabique de 129 mm. Incluida parte proporcional del resto de materiales: tornillería, pasta de juntas, masilla para encuentros perimetrales, fijaciones, junta estanca, etc. Montaje según norma de instalación UNE 102043 y exigencias del CTE."]
[null,null,70000,"2.1.9","TABIQUE MIXTO ATT® 139/600 (99)  [20+99+20]",600,99,20,"-","Tabique mixto formado por una placa BASIC de 20 mm de espesor compuesta por yeso natural, fibra de vidrio y aditivos inorgánicos que le aportan alta dureza y resistencia mecánica. Al otro lado, incorpora una placa HIDRO de 20 mm con tratamiento hidrófugo, disminuyendo así su capacidad de absorción de agua (menor al 5%). Idónea para proteger las estancias de los efectos adversos de la humedad. Reacción al fuego: EUROCLASE A1. Sistema de galces desiguales: las placas encajan entre ellas dejando una entrecalle de 3 mm por donde se inserta la pasta de juntas. Este sistema no utiliza cinta de papel. La pasta de juntas se aplica en las cavidades de las placas y una masilla elástica en los encuentros. Atornillada a cada lado de una estructura metálica de acero galvanizado formada por canales de 50 mm y montantes de 51x99x49 mm con una modulación de 600 mm entre ejes, dando un ancho total de tabique de 139 mm. Incluida parte proporcional del resto de materiales: tornillería, pasta de juntas, masilla para encuentros perimetrales, fijaciones, junta estanca, etc. Montaje según norma de instalación UNE 102043 y exigencias del CTE.","Tabique mixto formado por una placa BASIC de 20 mm de espesor compuesta por yeso natural, fibra de vidrio y aditivos inorgánicos que le aportan alta dureza y resistencia mecánica. Al otro lado, incorpora una placa FUEGO de 20 mm con perlita y un aumento en la densidad que la hace idónea para un excelente comportamiento y resistencia frente al fuego. Reacción al fuego: EUROCLASE A1. Sistema de galces desiguales: las placas encajan entre ellas dejando una entrecalle de 3 mm por donde se inserta la pasta de juntas. Este sistema no utiliza cinta de papel. La pasta de juntas se aplica en las cavidades de las placas y una masilla elástica en los encuentros. Atornillada a cada lado de una estructura metálica de acero galvanizado formada por canales de 50 mm y montantes de 51x99x49 mm con una modulación de 600 mm entre ejes, dando un ancho total de tabique de 139 mm. Incluida parte proporcional del resto de materiales: tornillería, pasta de juntas, masilla para encuentros perimetrales, fijaciones, junta estanca, etc. Montaje según norma de instalación UNE 102043 y exigencias del CTE.","Tabique mixto formado por una placa BASIC de 20 mm de espesor compuesta por yeso natural, fibra de vidrio y aditivos inorgánicos que le aportan alta dureza y resistencia mecánica. Al otro lado, incorpora una placa RESIST de 20 mm que con mayor cantidad de fibra de vidrio y dosificación modificada, aumenta su densidad, mejorando notablemente la resistencia mecánica. Idónea para lugares con altas exigencias en cuanto a deterioro y desgaste. Reacción al fuego: EUROCLASE A1. Sistema de galces desiguales: las placas encajan entre ellas dejando una entrecalle de 3 mm por donde se inserta la pasta de juntas. Este sistema no utiliza cinta de papel. La pasta de juntas se aplica en las cavidades de las placas y una masilla elástica en los encuentros. Atornillada a cada lado de una estructura metálica de acero galvanizado formada por canales de 50 mm y montantes de 51x99x49 mm con una modulación de 600 mm entre ejes, dando un ancho total de tabique de 139 mm. Incluida parte proporcional del resto de materiales: tornillería, pasta de juntas, masilla para encuentros perimetrales, fijaciones, junta estanca, etc. Montaje según norma de instalación UNE 102043 y exigencias del CTE.","Tabique mixto formado por una placa BASIC de 20 mm de espesor compuesta por yeso natural, fibra de vidrio y aditivos inorgánicos que le aportan alta dureza y resistencia mecánica. Al otro lado, incorpora una placa HIDROPLUS de 20 mm con tratamiento hidrófugo y un aumento en su densidad, características claves para una elevada resistencia a la humedad (absorción de agua menor al 3%) y una gran resistencia mecánica. Idónea para zonas de intemperie. Reacción al fuego: EUROCLASE A1. Sistema de galces desiguales: las placas encajan entre ellas dejando una entrecalle de 3 mm por donde se inserta la pasta de juntas. Este sistema no utiliza cinta de papel. La pasta de juntas se aplica en las cavidades de las placas y una masilla elástica en los encuentros. Atornillada a cada lado de una estructura metálica de acero galvanizado formada por canales de 50 mm y montantes de 51x99x49 mm con una modulación de 600 mm entre ejes, dando un ancho total de tabique de 139 mm. Incluida parte proporcional del resto de materiales: tornillería, pasta de juntas, masilla para encuentros perimetrales, fijaciones, junta estanca, etc. Montaje según norma de instalación UNE 102043 y exigencias del CTE.","Tabique mixto formado por una placa BASIC de 20 mm de espesor compuesta por yeso natural, fibra de vidrio y aditivos inorgánicos que le aportan alta dureza y resistencia mecánica. Al otro lado, incorpora una placa SUPREM de 20 mm con tratamiento hidrófugo, perlita y un aumento en la densidad para conseguir soluciones constructivas que cumplan, altos requisitos frente al fuego y una capacidad reducida de absorción de agua. Reacción al fuego: EUROCLASE A1. Sistema de galces desiguales: las placas encajan entre ellas dejando una entrecalle de 3 mm por donde se inserta la pasta de juntas. Este sistema no utiliza cinta de papel. La pasta de juntas se aplica en las cavidades de las placas y una masilla elástica en los encuentros. Atornillada a cada lado de una estructura metálica de acero galvanizado formada por canales de 50 mm y montantes de 51x99x49 mm con una modulación de 600 mm entre ejes, dando un ancho total de tabique de 139 mm. Incluida parte proporcional del resto de materiales: tornillería, pasta de juntas, masilla para encuentros perimetrales, fijaciones, junta estanca, etc. Montaje según norma de instalación UNE 102043 y exigencias del CTE."]
[null,null,44965,"2.1.10","TABIQUE MIXTO ATT® 75/400 (49)  [13+49+13]",400,49,13,"-","Tabique mixto formado por una placa BASIC de 13 mm de espesor compuesta por yeso natural, fibra de vidrio y aditivos inorgánicos que le aportan alta dureza y resistencia mecánica. Al otro lado, incorpora una placa HIDRO de 13 mm con tratamiento hidrófugo, disminuyendo así su capacidad de absorción de agua (menor al 5%). Idónea para proteger las estancias de los efectos adversos de la humedad. Reacción al fuego: EUROCLASE A1. Sistema de galces desiguales: las placas encajan entre ellas dejando una entrecalle de 3 mm por donde se inserta la pasta de juntas. Este sistema no utiliza cinta de papel. La pasta de juntas se aplica en las cavidades de las placas y una masilla elástica en los encuentros. Atornillada a cada lado de una estructura metálica de acero galvanizado formada por canales de 50 mm y montantes de 51x49x49 mm con una modulación de 400 mm entre ejes, dando un ancho total de tabique de 75 mm. Incluida parte proporcional del resto de materiales: tornillería, pasta de juntas, masilla para encuentros perimetrales, fijaciones, junta estanca, etc. Montaje según norma de instalación UNE 102043 y exigencias del CTE.","Tabique mixto formado por una placa BASIC de 13 mm de espesor compuesta por yeso natural, fibra de vidrio y aditivos inorgánicos que le aportan alta dureza y resistencia mecánica. Al otro lado, incorpora una placa FUEGO de 13 mm con perlita y un aumento en la densidad que la hace idónea para un excelente comportamiento y resistencia frente al fuego. Reacción al fuego: EUROCLASE A1. Sistema de galces desiguales: las placas encajan entre ellas dejando una entrecalle de 3 mm por donde se inserta la pasta de juntas. Este sistema no utiliza cinta de papel. La pasta de juntas se aplica en las cavidades de las placas y una masilla elástica en los encuentros. Atornillada a cada lado de una estructura metálica de acero galvanizado formada por canales de 50 mm y montantes de 51x49x49 mm con una modulación de 400 mm entre ejes, dando un ancho total de tabique de 75 mm. Incluida parte proporcional del resto de materiales: tornillería, pasta de juntas, masilla para encuentros perimetrales, fijaciones, junta estanca, etc. Montaje según norma de instalación UNE 102043 y exigencias del CTE.","Tabique mixto formado por una placa BASIC de 13 mm de espesor compuesta por yeso natural, fibra de vidrio y aditivos inorgánicos que le aportan alta dureza y resistencia mecánica. Al otro lado, incorpora una placa RESIST de 13 mm que con mayor cantidad de fibra de vidrio y dosificación modificada, aumenta su densidad, mejorando notablemente la resistencia mecánica. Idónea para lugares con altas exigencias en cuanto a deterioro y desgaste. Reacción al fuego: EUROCLASE A1. Sistema de galces desiguales: las placas encajan entre ellas dejando una entrecalle de 3 mm por donde se inserta la pasta de juntas. Este sistema no utiliza cinta de papel. La pasta de juntas se aplica en las cavidades de las placas y una masilla elástica en los encuentros. Atornillada a cada lado de una estructura metálica de acero galvanizado formada por canales de 50 mm y montantes de 51x49x49 mm con una modulación de 400 mm entre ejes, dando un ancho total de tabique de 75 mm. Incluida parte proporcional del resto de materiales: tornillería, pasta de juntas, masilla para encuentros perimetrales, fijaciones, junta estanca, etc. Montaje según norma de instalación UNE 102043 y exigencias del CTE.","Tabique mixto formado por una placa BASIC de 13 mm de espesor compuesta por yeso natural, fibra de vidrio y aditivos inorgánicos que le aportan alta dureza y resistencia mecánica. Al otro lado, incorpora una placa HIDROPLUS de 13 mm con tratamiento hidrófugo y un aumento en su densidad, características claves para una elevada resistencia a la humedad (absorción de agua menor al 3%) y una gran resistencia mecánica. Idónea para zonas de intemperie. Reacción al fuego: EUROCLASE A1. Sistema de galces desiguales: las placas encajan entre ellas dejando una entrecalle de 3 mm por donde se inserta la pasta de juntas. Este sistema no utiliza cinta de papel. La pasta de juntas se aplica en las cavidades de las placas y una masilla elástica en los encuentros. Atornillada a cada lado de una estructura metálica de acero galvanizado formada por canales de 50 mm y montantes de 51x49x49 mm con una modulación de 400 mm entre ejes, dando un ancho total de tabique de 75 mm. Incluida parte proporcional del resto de materiales: tornillería, pasta de juntas, masilla para encuentros perimetrales, fijaciones, junta estanca, etc. Montaje según norma de instalación UNE 102043 y exigencias del CTE.","Tabique mixto formado por una placa BASIC de 13 mm de espesor compuesta por yeso natural, fibra de vidrio y aditivos inorgánicos que le aportan alta dureza y resistencia mecánica. Al otro lado, incorpora una placa SUPREM de 13 mm con tratamiento hidrófugo, perlita y un aumento en la densidad para conseguir soluciones constructivas que cumplan, altos requisitos frente al fuego y una capacidad reducida de absorción de agua. Reacción al fuego: EUROCLASE A1. Sistema de galces desiguales: las placas encajan entre ellas dejando una entrecalle de 3 mm por donde se inserta la pasta de juntas. Este sistema no utiliza cinta de papel. La pasta de juntas se aplica en las cavidades de las placas y una masilla elástica en los encuentros. Atornillada a cada lado de una estructura metálica de acero galvanizado formada por canales de 50 mm y montantes de 51x49x49 mm con una modulación de 400 mm entre ejes, dando un ancho total de tabique de 75 mm. Incluida parte proporcional del resto de materiales: tornillería, pasta de juntas, masilla para encuentros perimetrales, fijaciones, junta estanca, etc. Montaje según norma de instalación UNE 102043 y exigencias del CTE."]
[null,null,44975,"2.1.11","TABIQUE MIXTO ATT® 79/400 (49)  [15+49+15]",400,49,15,"-","Tabique mixto formado por una placa BASIC de 15 mm de espesor compuesta por yeso natural, fibra de vidrio y aditivos inorgánicos que le aportan alta dureza y resistencia mecánica. Al otro lado, incorpora una placa HIDRO de 15 mm con tratamiento hidrófugo, disminuyendo así su capacidad de absorción de agua (menor al 5%). Idónea para proteger las estancias de los efectos adversos de la humedad. Reacción al fuego: EUROCLASE A1. Sistema de galces desiguales: las placas encajan entre ellas dejando una entrecalle de 3 mm por donde se inserta la pasta de juntas. Este sistema no utiliza cinta de papel. La pasta de juntas se aplica en las cavidades de las placas y una masilla elástica en los encuentros. Atornillada a cada lado de una estructura metálica de acero galvanizado formada por canales de 50 mm y montantes de 51x49x49 mm con una modulación de 400 mm entre ejes, dando un ancho total de tabique de 79 mm. Incluida parte proporcional del resto de materiales: tornillería, pasta de juntas, masilla para encuentros perimetrales, fijaciones, junta estanca, etc. Montaje según norma de instalación UNE 102043 y exigencias del CTE.","Tabique mixto formado por una placa BASIC de 15 mm de espesor compuesta por yeso natural, fibra de vidrio y aditivos inorgánicos que le aportan alta dureza y resistencia mecánica. Al otro lado, incorpora una placa FUEGO de 15 mm con perlita y un aumento en la densidad que la hace idónea para un excelente comportamiento y resistencia frente al fuego. Reacción al fuego: EUROCLASE A1. Sistema de galces desiguales: las placas encajan entre ellas dejando una entrecalle de 3 mm por donde se inserta la pasta de juntas. Este sistema no utiliza cinta de papel. La pasta de juntas se aplica en las cavidades de las placas y una masilla elástica en los encuentros. Atornillada a cada lado de una estructura metálica de acero galvanizado formada por canales de 50 mm y montantes de 51x49x49 mm con una modulación de 400 mm entre ejes, dando un ancho total de tabique de 79 mm. Incluida parte proporcional del resto de materiales: tornillería, pasta de juntas, masilla para encuentros perimetrales, fijaciones, junta estanca, etc. Montaje según norma de instalación UNE 102043 y exigencias del CTE.","Tabique mixto formado por una placa BASIC de 15 mm de espesor compuesta por yeso natural, fibra de vidrio y aditivos inorgánicos que le aportan alta dureza y resistencia mecánica. Al otro lado, incorpora una placa RESIST de 15 mm que con mayor cantidad de fibra de vidrio y dosificación modificada, aumenta su densidad, mejorando notablemente la resistencia mecánica. Idónea para lugares con altas exigencias en cuanto a deterioro y desgaste. Reacción al fuego: EUROCLASE A1. Sistema de galces desiguales: las placas encajan entre ellas dejando una entrecalle de 3 mm por donde se inserta la pasta de juntas. Este sistema no utiliza cinta de papel. La pasta de juntas se aplica en las cavidades de las placas y una masilla elástica en los encuentros. Atornillada a cada lado de una estructura metálica de acero galvanizado formada por canales de 50 mm y montantes de 51x49x49 mm con una modulación de 400 mm entre ejes, dando un ancho total de tabique de 79 mm. Incluida parte proporcional del resto de materiales: tornillería, pasta de juntas, masilla para encuentros perimetrales, fijaciones, junta estanca, etc. Montaje según norma de instalación UNE 102043 y exigencias del CTE.","Tabique mixto formado por una placa BASIC de 15 mm de espesor compuesta por yeso natural, fibra de vidrio y aditivos inorgánicos que le aportan alta dureza y resistencia mecánica. Al otro lado, incorpora una placa HIDROPLUS de 15 mm con tratamiento hidrófugo y un aumento en su densidad, características claves para una elevada resistencia a la humedad (absorción de agua menor al 3%) y una gran resistencia mecánica. Idónea para zonas de intemperie. Reacción al fuego: EUROCLASE A1. Sistema de galces desiguales: las placas encajan entre ellas dejando una entrecalle de 3 mm por donde se inserta la pasta de juntas. Este sistema no utiliza cinta de papel. La pasta de juntas se aplica en las cavidades de las placas y una masilla elástica en los encuentros. Atornillada a cada lado de una estructura metálica de acero galvanizado formada por canales de 50 mm y montantes de 51x49x49 mm con una modulación de 400 mm entre ejes, dando un ancho total de tabique de 79 mm. Incluida parte proporcional del resto de materiales: tornillería, pasta de juntas, masilla para encuentros perimetrales, fijaciones, junta estanca, etc. Montaje según norma de instalación UNE 102043 y exigencias del CTE.","Tabique mixto formado por una placa BASIC de 15 mm de espesor compuesta por yeso natural, fibra de vidrio y aditivos inorgánicos que le aportan alta dureza y resistencia mecánica. Al otro lado, incorpora una placa SUPREM de 15 mm con tratamiento hidrófugo, perlita y un aumento en la densidad para conseguir soluciones constructivas que cumplan, altos requisitos frente al fuego y una capacidad reducida de absorción de agua. Reacción al fuego: EUROCLASE A1. Sistema de galces desiguales: las placas encajan entre ellas dejando una entrecalle de 3 mm por donde se inserta la pasta de juntas. Este sistema no utiliza cinta de papel. La pasta de juntas se aplica en las cavidades de las placas y una masilla elástica en los encuentros. Atornillada a cada lado de una estructura metálica de acero galvanizado formada por canales de 50 mm y montantes de 51x49x49 mm con una modulación de 400 mm entre ejes, dando un ancho total de tabique de 79 mm. Incluida parte proporcional del resto de materiales: tornillería, pasta de juntas, masilla para encuentros perimetrales, fijaciones, junta estanca, etc. Montaje según norma de instalación UNE 102043 y exigencias del CTE."]
[null,null,45000,"2.1.12","TABIQUE MIXTO ATT® 89/400 (49)  [20+49+20]",400,49,20,"-","Tabique mixto formado por una placa BASIC de 20 mm de espesor compuesta por yeso natural, fibra de vidrio y aditivos inorgánicos que le aportan alta dureza y resistencia mecánica. Al otro lado, incorpora una placa HIDRO de 20 mm con tratamiento hidrófugo, disminuyendo así su capacidad de absorción de agua (menor al 5%). Idónea para proteger las estancias de los efectos adversos de la humedad. Reacción al fuego: EUROCLASE A1. Sistema de galces desiguales: las placas encajan entre ellas dejando una entrecalle de 3 mm por donde se inserta la pasta de juntas. Este sistema no utiliza cinta de papel. La pasta de juntas se aplica en las cavidades de las placas y una masilla elástica en los encuentros. Atornillada a cada lado de una estructura metálica de acero galvanizado formada por canales de 50 mm y montantes de 51x49x49 mm con una modulación de 400 mm entre ejes, dando un ancho total de tabique de 89 mm. Incluida parte proporcional del resto de materiales: tornillería, pasta de juntas, masilla para encuentros perimetrales, fijaciones, junta estanca, etc. Montaje según norma de instalación UNE 102043 y exigencias del CTE.","Tabique mixto formado por una placa BASIC de 20 mm de espesor compuesta por yeso natural, fibra de vidrio y aditivos inorgánicos que le aportan alta dureza y resistencia mecánica. Al otro lado, incorpora una placa FUEGO de 20 mm con perlita y un aumento en la densidad que la hace idónea para un excelente comportamiento y resistencia frente al fuego. Reacción al fuego: EUROCLASE A1. Sistema de galces desiguales: las placas encajan entre ellas dejando una entrecalle de 3 mm por donde se inserta la pasta de juntas. Este sistema no utiliza cinta de papel. La pasta de juntas se aplica en las cavidades de las placas y una masilla elástica en los encuentros. Atornillada a cada lado de una estructura metálica de acero galvanizado formada por canales de 50 mm y montantes de 51x49x49 mm con una modulación de 400 mm entre ejes, dando un ancho total de tabique de 89 mm. Incluida parte proporcional del resto de materiales: tornillería, pasta de juntas, masilla para encuentros perimetrales, fijaciones, junta estanca, etc. Montaje según norma de instalación UNE 102043 y exigencias del CTE.","Tabique mixto formado por una placa BASIC de 20 mm de espesor compuesta por yeso natural, fibra de vidrio y aditivos inorgánicos que le aportan alta dureza y resistencia mecánica. Al otro lado, incorpora una placa RESIST de 20 mm que con mayor cantidad de fibra de vidrio y dosificación modificada, aumenta su densidad, mejorando notablemente la resistencia mecánica. Idónea para lugares con altas exigencias en cuanto a deterioro y desgaste. Reacción al fuego: EUROCLASE A1. Sistema de galces desiguales: las placas encajan entre ellas dejando una entrecalle de 3 mm por donde se inserta la pasta de juntas. Este sistema no utiliza cinta de papel. La pasta de juntas se aplica en las cavidades de las placas y una masilla elástica en los encuentros. Atornillada a cada lado de una estructura metálica de acero galvanizado formada por canales de 50 mm y montantes de 51x49x49 mm con una modulación de 400 mm entre ejes, dando un ancho total de tabique de 89 mm. Incluida parte proporcional del resto de materiales: tornillería, pasta de juntas, masilla para encuentros perimetrales, fijaciones, junta estanca, etc. Montaje según norma de instalación UNE 102043 y exigencias del CTE.","Tabique mixto formado por una placa BASIC de 20 mm de espesor compuesta por yeso natural, fibra de vidrio y aditivos inorgánicos que le aportan alta dureza y resistencia mecánica. Al otro lado, incorpora una placa HIDROPLUS de 20 mm con tratamiento hidrófugo y un aumento en su densidad, características claves para una elevada resistencia a la humedad (absorción de agua menor al 3%) y una gran resistencia mecánica. Idónea para zonas de intemperie. Reacción al fuego: EUROCLASE A1. Sistema de galces desiguales: las placas encajan entre ellas dejando una entrecalle de 3 mm por donde se inserta la pasta de juntas. Este sistema no utiliza cinta de papel. La pasta de juntas se aplica en las cavidades de las placas y una masilla elástica en los encuentros. Atornillada a cada lado de una estructura metálica de acero galvanizado formada por canales de 50 mm y montantes de 51x49x49 mm con una modulación de 400 mm entre ejes, dando un ancho total de tabique de 89 mm. Incluida parte proporcional del resto de materiales: tornillería, pasta de juntas, masilla para encuentros perimetrales, fijaciones, junta estanca, etc. Montaje según norma de instalación UNE 102043 y exigencias del CTE.","Tabique mixto formado por una placa BASIC de 20 mm de espesor compuesta por yeso natural, fibra de vidrio y aditivos inorgánicos que le aportan alta dureza y resistencia mecánica. Al otro lado, incorpora una placa SUPREM de 20 mm con tratamiento hidrófugo, perlita y un aumento en la densidad para conseguir soluciones constructivas que cumplan, altos requisitos frente al fuego y una capacidad reducida de absorción de agua. Reacción al fuego: EUROCLASE A1. Sistema de galces desiguales: las placas encajan entre ellas dejando una entrecalle de 3 mm por donde se inserta la pasta de juntas. Este sistema no utiliza cinta de papel. La pasta de juntas se aplica en las cavidades de las placas y una masilla elástica en los encuentros. Atornillada a cada lado de una estructura metálica de acero galvanizado formada por canales de 50 mm y montantes de 51x49x49 mm con una modulación de 400 mm entre ejes, dando un ancho total de tabique de 89 mm. Incluida parte proporcional del resto de materiales: tornillería, pasta de juntas, masilla para encuentros perimetrales, fijaciones, junta estanca, etc. Montaje según norma de instalación UNE 102043 y exigencias del CTE."]
[null,null,47465,"2.1.13","TABIQUE MIXTO ATT® 100/400 (74)  [13+74+13]",400,74,13,"-","Tabique mixto formado por una placa BASIC de 13 mm de espesor compuesta por yeso natural, fibra de vidrio y aditivos inorgánicos que le aportan alta dureza y resistencia mecánica. Al otro lado, incorpora una placa HIDRO de 13 mm con tratamiento hidrófugo, disminuyendo así su capacidad de absorción de agua (menor al 5%). Idónea para proteger las estancias de los efectos adversos de la humedad. Reacción al fuego: EUROCLASE A1. Sistema de galces desiguales: las placas encajan entre ellas dejando una entrecalle de 3 mm por donde se inserta la pasta de juntas. Este sistema no utiliza cinta de papel. La pasta de juntas se aplica en las cavidades de las placas y una masilla elástica en los encuentros. Atornillada a cada lado de una estructura metálica de acero galvanizado formada por canales de 50 mm y montantes de 51x74x49 mm con una modulación de 400 mm entre ejes, dando un ancho total de tabique de 100 mm. Incluida parte proporcional del resto de materiales: tornillería, pasta de juntas, masilla para encuentros perimetrales, fijaciones, junta estanca, etc. Montaje según norma de instalación UNE 102043 y exigencias del CTE.","Tabique mixto formado por una placa BASIC de 13 mm de espesor compuesta por yeso natural, fibra de vidrio y aditivos inorgánicos que le aportan alta dureza y resistencia mecánica. Al otro lado, incorpora una placa FUEGO de 13 mm con perlita y un aumento en la densidad que la hace idónea para un excelente comportamiento y resistencia frente al fuego. Reacción al fuego: EUROCLASE A1. Sistema de galces desiguales: las placas encajan entre ellas dejando una entrecalle de 3 mm por donde se inserta la pasta de juntas. Este sistema no utiliza cinta de papel. La pasta de juntas se aplica en las cavidades de las placas y una masilla elástica en los encuentros. Atornillada a cada lado de una estructura metálica de acero galvanizado formada por canales de 50 mm y montantes de 51x74x49 mm con una modulación de 400 mm entre ejes, dando un ancho total de tabique de 100 mm. Incluida parte proporcional del resto de materiales: tornillería, pasta de juntas, masilla para encuentros perimetrales, fijaciones, junta estanca, etc. Montaje según norma de instalación UNE 102043 y exigencias del CTE.","Tabique mixto formado por una placa BASIC de 13 mm de espesor compuesta por yeso natural, fibra de vidrio y aditivos inorgánicos que le aportan alta dureza y resistencia mecánica. Al otro lado, incorpora una placa RESIST de 13 mm que con mayor cantidad de fibra de vidrio y dosificación modificada, aumenta su densidad, mejorando notablemente la resistencia mecánica. Idónea para lugares con altas exigencias en cuanto a deterioro y desgaste. Reacción al fuego: EUROCLASE A1. Sistema de galces desiguales: las placas encajan entre ellas dejando una entrecalle de 3 mm por donde se inserta la pasta de juntas. Este sistema no utiliza cinta de papel. La pasta de juntas se aplica en las cavidades de las placas y una masilla elástica en los encuentros. Atornillada a cada lado de una estructura metálica de acero galvanizado formada por canales de 50 mm y montantes de 51x74x49 mm con una modulación de 400 mm entre ejes, dando un ancho total de tabique de 100 mm. Incluida parte proporcional del resto de materiales: tornillería, pasta de juntas, masilla para encuentros perimetrales, fijaciones, junta estanca, etc. Montaje según norma de instalación UNE 102043 y exigencias del CTE.","Tabique mixto formado por una placa BASIC de 13 mm de espesor compuesta por yeso natural, fibra de vidrio y aditivos inorgánicos que le aportan alta dureza y resistencia mecánica. Al otro lado, incorpora una placa HIDROPLUS de 13 mm con tratamiento hidrófugo y un aumento en su densidad, características claves para una elevada resistencia a la humedad (absorción de agua menor al 3%) y una gran resistencia mecánica. Idónea para zonas de intemperie. Reacción al fuego: EUROCLASE A1. Sistema de galces desiguales: las placas encajan entre ellas dejando una entrecalle de 3 mm por donde se inserta la pasta de juntas. Este sistema no utiliza cinta de papel. La pasta de juntas se aplica en las cavidades de las placas y una masilla elástica en los encuentros. Atornillada a cada lado de una estructura metálica de acero galvanizado formada por canales de 50 mm y montantes de 51x74x49 mm con una modulación de 400 mm entre ejes, dando un ancho total de tabique de 100 mm. Incluida parte proporcional del resto de materiales: tornillería, pasta de juntas, masilla para encuentros perimetrales, fijaciones, junta estanca, etc. Montaje según norma de instalación UNE 102043 y exigencias del CTE.","Tabique mixto formado por una placa BASIC de 13 mm de espesor compuesta por yeso natural, fibra de vidrio y aditivos inorgánicos que le aportan alta dureza y resistencia mecánica. Al otro lado, incorpora una placa SUPREM de 13 mm con tratamiento hidrófugo, perlita y un aumento en la densidad para conseguir soluciones constructivas que cumplan, altos requisitos frente al fuego y una capacidad reducida de absorción de agua. Reacción al fuego: EUROCLASE A1. Sistema de galces desiguales: las placas encajan entre ellas dejando una entrecalle de 3 mm por donde se inserta la pasta de juntas. Este sistema no utiliza cinta de papel. La pasta de juntas se aplica en las cavidades de las placas y una masilla elástica en los encuentros. Atornillada a cada lado de una estructura metálica de acero galvanizado formada por canales de 50 mm y montantes de 51x74x49 mm con una modulación de 400 mm entre ejes, dando un ancho total de tabique de 100 mm. Incluida parte proporcional del resto de materiales: tornillería, pasta de juntas, masilla para encuentros perimetrales, fijaciones, junta estanca, etc. Montaje según norma de instalación UNE 102043 y exigencias del CTE."]
[null,null,47475,"2.1.14","TABIQUE MIXTO ATT® 104/400 (74)  [15+74+15]",400,74,15,"-","Tabique mixto formado por una placa BASIC de 15 mm de espesor compuesta por yeso natural, fibra de vidrio y aditivos inorgánicos que le aportan alta dureza y resistencia mecánica. Al otro lado, incorpora una placa HIDRO de 15 mm con tratamiento hidrófugo, disminuyendo así su capacidad de absorción de agua (menor al 5%). Idónea para proteger las estancias de los efectos adversos de la humedad. Reacción al fuego: EUROCLASE A1. Sistema de galces desiguales: las placas encajan entre ellas dejando una entrecalle de 3 mm por donde se inserta la pasta de juntas. Este sistema no utiliza cinta de papel. La pasta de juntas se aplica en las cavidades de las placas y una masilla elástica en los encuentros. Atornillada a cada lado de una estructura metálica de acero galvanizado formada por canales de 50 mm y montantes de 51x74x49 mm con una modulación de 400 mm entre ejes, dando un ancho total de tabique de 104 mm. Incluida parte proporcional del resto de materiales: tornillería, pasta de juntas, masilla para encuentros perimetrales, fijaciones, junta estanca, etc. Montaje según norma de instalación UNE 102043 y exigencias del CTE.","Tabique mixto formado por una placa BASIC de 15 mm de espesor compuesta por yeso natural, fibra de vidrio y aditivos inorgánicos que le aportan alta dureza y resistencia mecánica. Al otro lado, incorpora una placa FUEGO de 15 mm con perlita y un aumento en la densidad que la hace idónea para un excelente comportamiento y resistencia frente al fuego. Reacción al fuego: EUROCLASE A1. Sistema de galces desiguales: las placas encajan entre ellas dejando una entrecalle de 3 mm por donde se inserta la pasta de juntas. Este sistema no utiliza cinta de papel. La pasta de juntas se aplica en las cavidades de las placas y una masilla elástica en los encuentros. Atornillada a cada lado de una estructura metálica de acero galvanizado formada por canales de 50 mm y montantes de 51x74x49 mm con una modulación de 400 mm entre ejes, dando un ancho total de tabique de 104 mm. Incluida parte proporcional del resto de materiales: tornillería, pasta de juntas, masilla para encuentros perimetrales, fijaciones, junta estanca, etc. Montaje según norma de instalación UNE 102043 y exigencias del CTE.","Tabique mixto formado por una placa BASIC de 15 mm de espesor compuesta por yeso natural, fibra de vidrio y aditivos inorgánicos que le aportan alta dureza y resistencia mecánica. Al otro lado, incorpora una placa RESIST de 15 mm que con mayor cantidad de fibra de vidrio y dosificación modificada, aumenta su densidad, mejorando notablemente la resistencia mecánica. Idónea para lugares con altas exigencias en cuanto a deterioro y desgaste. Reacción al fuego: EUROCLASE A1. Sistema de galces desiguales: las placas encajan entre ellas dejando una entrecalle de 3 mm por donde se inserta la pasta de juntas. Este sistema no utiliza cinta de papel. La pasta de juntas se aplica en las cavidades de las placas y una masilla elástica en los encuentros. Atornillada a cada lado de una estructura metálica de acero galvanizado formada por canales de 50 mm y montantes de 51x74x49 mm con una modulación de 400 mm entre ejes, dando un ancho total de tabique de 104 mm. Incluida parte proporcional del resto de materiales: tornillería, pasta de juntas, masilla para encuentros perimetrales, fijaciones, junta estanca, etc. Montaje según norma de instalación UNE 102043 y exigencias del CTE.","Tabique mixto formado por una placa BASIC de 15 mm de espesor compuesta por yeso natural, fibra de vidrio y aditivos inorgánicos que le aportan alta dureza y resistencia mecánica. Al otro lado, incorpora una placa HIDROPLUS de 15 mm con tratamiento hidrófugo y un aumento en su densidad, características claves para una elevada resistencia a la humedad (absorción de agua menor al 3%) y una gran resistencia mecánica. Idónea para zonas de intemperie. Reacción al fuego: EUROCLASE A1. Sistema de galces desiguales: las placas encajan entre ellas dejando una entrecalle de 3 mm por donde se inserta la pasta de juntas. Este sistema no utiliza cinta de papel. La pasta de juntas se aplica en las cavidades de las placas y una masilla elástica en los encuentros. Atornillada a cada lado de una estructura metálica de acero galvanizado formada por canales de 50 mm y montantes de 51x74x49 mm con una modulación de 400 mm entre ejes, dando un ancho total de tabique de 104 mm. Incluida parte proporcional del resto de materiales: tornillería, pasta de juntas, masilla para encuentros perimetrales, fijaciones, junta estanca, etc. Montaje según norma de instalación UNE 102043 y exigencias del CTE.","Tabique mixto formado por una placa BASIC de 15 mm de espesor compuesta por yeso natural, fibra de vidrio y aditivos inorgánicos que le aportan alta dureza y resistencia mecánica. Al otro lado, incorpora una placa SUPREM de 15 mm con tratamiento hidrófugo, perlita y un aumento en la densidad para conseguir soluciones constructivas que cumplan, altos requisitos frente al fuego y una capacidad reducida de absorción de agua. Reacción al fuego: EUROCLASE A1. Sistema de galces desiguales: las placas encajan entre ellas dejando una entrecalle de 3 mm por donde se inserta la pasta de juntas. Este sistema no utiliza cinta de papel. La pasta de juntas se aplica en las cavidades de las placas y una masilla elástica en los encuentros. Atornillada a cada lado de una estructura metálica de acero galvanizado formada por canales de 50 mm y montantes de 51x74x49 mm con una modulación de 400 mm entre ejes, dando un ancho total de tabique de 104 mm. Incluida parte proporcional del resto de materiales: tornillería, pasta de juntas, masilla para encuentros perimetrales, fijaciones, junta estanca, etc. Montaje según norma de instalación UNE 102043 y exigencias del CTE."]
[null,null,47500,"2.1.15","TABIQUE MIXTO ATT® 114/400 (74)  [20+74+20]",400,74,20,"-","Tabique mixto formado por una placa BASIC de 20 mm de espesor compuesta por yeso natural, fibra de vidrio y aditivos inorgánicos que le aportan alta dureza y resistencia mecánica. Al otro lado, incorpora una placa HIDRO de 20 mm con tratamiento hidrófugo, disminuyendo así su capacidad de absorción de agua (menor al 5%). Idónea para proteger las estancias de los efectos adversos de la humedad. Reacción al fuego: EUROCLASE A1. Sistema de galces desiguales: las placas encajan entre ellas dejando una entrecalle de 3 mm por donde se inserta la pasta de juntas. Este sistema no utiliza cinta de papel. La pasta de juntas se aplica en las cavidades de las placas y una masilla elástica en los encuentros. Atornillada a cada lado de una estructura metálica de acero galvanizado formada por canales de 50 mm y montantes de 51x74x49 mm con una modulación de 400 mm entre ejes, dando un ancho total de tabique de 114 mm. Incluida parte proporcional del resto de materiales: tornillería, pasta de juntas, masilla para encuentros perimetrales, fijaciones, junta estanca, etc. Montaje según norma de instalación UNE 102043 y exigencias del CTE.","Tabique mixto formado por una placa BASIC de 20 mm de espesor compuesta por yeso natural, fibra de vidrio y aditivos inorgánicos que le aportan alta dureza y resistencia mecánica. Al otro lado, incorpora una placa FUEGO de 20 mm con perlita y un aumento en la densidad que la hace idónea para un excelente comportamiento y resistencia frente al fuego. Reacción al fuego: EUROCLASE A1. Sistema de galces desiguales: las placas encajan entre ellas dejando una entrecalle de 3 mm por donde se inserta la pasta de juntas. Este sistema no utiliza cinta de papel. La pasta de juntas se aplica en las cavidades de las placas y una masilla elástica en los encuentros. Atornillada a cada lado de una estructura metálica de acero galvanizado formada por canales de 50 mm y montantes de 51x74x49 mm con una modulación de 400 mm entre ejes, dando un ancho total de tabique de 114 mm. Incluida parte proporcional del resto de materiales: tornillería, pasta de juntas, masilla para encuentros perimetrales, fijaciones, junta estanca, etc. Montaje según norma de instalación UNE 102043 y exigencias del CTE.","Tabique mixto formado por una placa BASIC de 20 mm de espesor compuesta por yeso natural, fibra de vidrio y aditivos inorgánicos que le aportan alta dureza y resistencia mecánica. Al otro lado, incorpora una placa RESIST de 20 mm que con mayor cantidad de fibra de vidrio y dosificación modificada, aumenta su densidad, mejorando notablemente la resistencia mecánica. Idónea para lugares con altas exigencias en cuanto a deterioro y desgaste. Reacción al fuego: EUROCLASE A1. Sistema de galces desiguales: las placas encajan entre ellas dejando una entrecalle de 3 mm por donde se inserta la pasta de juntas. Este sistema no utiliza cinta de papel. La pasta de juntas se aplica en las cavidades de las placas y una masilla elástica en los encuentros. Atornillada a cada lado de una estructura metálica de acero galvanizado formada por canales de 50 mm y montantes de 51x74x49 mm con una modulación de 400 mm entre ejes, dando un ancho total de tabique de 114 mm. Incluida parte proporcional del resto de materiales: tornillería, pasta de juntas, masilla para encuentros perimetrales, fijaciones, junta estanca, etc. Montaje según norma de instalación UNE 102043 y exigencias del CTE.","Tabique mixto formado por una placa BASIC de 20 mm de espesor compuesta por yeso natural, fibra de vidrio y aditivos inorgánicos que le aportan alta dureza y resistencia mecánica. Al otro lado, incorpora una placa HIDROPLUS de 20 mm con tratamiento hidrófugo y un aumento en su densidad, características claves para una elevada resistencia a la humedad (absorción de agua menor al 3%) y una gran resistencia mecánica. Idónea para zonas de intemperie. Reacción al fuego: EUROCLASE A1. Sistema de galces desiguales: las placas encajan entre ellas dejando una entrecalle de 3 mm por donde se inserta la pasta de juntas. Este sistema no utiliza cinta de papel. La pasta de juntas se aplica en las cavidades de las placas y una masilla elástica en los encuentros. Atornillada a cada lado de una estructura metálica de acero galvanizado formada por canales de 50 mm y montantes de 51x74x49 mm con una modulación de 400 mm entre ejes, dando un ancho total de tabique de 114 mm. Incluida parte proporcional del resto de materiales: tornillería, pasta de juntas, masilla para encuentros perimetrales, fijaciones, junta estanca, etc. Montaje según norma de instalación UNE 102043 y exigencias del CTE.","Tabique mixto formado por una placa BASIC de 20 mm de espesor compuesta por yeso natural, fibra de vidrio y aditivos inorgánicos que le aportan alta dureza y resistencia mecánica. Al otro lado, incorpora una placa SUPREM de 20 mm con tratamiento hidrófugo, perlita y un aumento en la densidad para conseguir soluciones constructivas que cumplan, altos requisitos frente al fuego y una capacidad reducida de absorción de agua. Reacción al fuego: EUROCLASE A1. Sistema de galces desiguales: las placas encajan entre ellas dejando una entrecalle de 3 mm por donde se inserta la pasta de juntas. Este sistema no utiliza cinta de papel. La pasta de juntas se aplica en las cavidades de las placas y una masilla elástica en los encuentros. Atornillada a cada lado de una estructura metálica de acero galvanizado formada por canales de 50 mm y montantes de 51x74x49 mm con una modulación de 400 mm entre ejes, dando un ancho total de tabique de 114 mm. Incluida parte proporcional del resto de materiales: tornillería, pasta de juntas, masilla para encuentros perimetrales, fijaciones, junta estanca, etc. Montaje según norma de instalación UNE 102043 y exigencias del CTE."]
[null,null,49965,"2.1.16","TABIQUE MIXTO ATT® 125/400 (99)  [13+99+13]",400,99,13,"-","Tabique mixto formado por una placa BASIC de 13 mm de espesor compuesta por yeso natural, fibra de vidrio y aditivos inorgánicos que le aportan alta dureza y resistencia mecánica. Al otro lado, incorpora una placa HIDRO de 13 mm con tratamiento hidrófugo, disminuyendo así su capacidad de absorción de agua (menor al 5%). Idónea para proteger las estancias de los efectos adversos de la humedad. Reacción al fuego: EUROCLASE A1. Sistema de galces desiguales: las placas encajan entre ellas dejando una entrecalle de 3 mm por donde se inserta la pasta de juntas. Este sistema no utiliza cinta de papel. La pasta de juntas se aplica en las cavidades de las placas y una masilla elástica en los encuentros. Atornillada a cada lado de una estructura metálica de acero galvanizado formada por canales de 50 mm y montantes de 51x99x49 mm con una modulación de 400 mm entre ejes, dando un ancho total de tabique de 125 mm. Incluida parte proporcional del resto de materiales: tornillería, pasta de juntas, masilla para encuentros perimetrales, fijaciones, junta estanca, etc. Montaje según norma de instalación UNE 102043 y exigencias del CTE.","Tabique mixto formado por una placa BASIC de 13 mm de espesor compuesta por yeso natural, fibra de vidrio y aditivos inorgánicos que le aportan alta dureza y resistencia mecánica. Al otro lado, incorpora una placa FUEGO de 13 mm con perlita y un aumento en la densidad que la hace idónea para un excelente comportamiento y resistencia frente al fuego. Reacción al fuego: EUROCLASE A1. Sistema de galces desiguales: las placas encajan entre ellas dejando una entrecalle de 3 mm por donde se inserta la pasta de juntas. Este sistema no utiliza cinta de papel. La pasta de juntas se aplica en las cavidades de las placas y una masilla elástica en los encuentros. Atornillada a cada lado de una estructura metálica de acero galvanizado formada por canales de 50 mm y montantes de 51x99x49 mm con una modulación de 400 mm entre ejes, dando un ancho total de tabique de 125 mm. Incluida parte proporcional del resto de materiales: tornillería, pasta de juntas, masilla para encuentros perimetrales, fijaciones, junta estanca, etc. Montaje según norma de instalación UNE 102043 y exigencias del CTE.","Tabique mixto formado por una placa BASIC de 13 mm de espesor compuesta por yeso natural, fibra de vidrio y aditivos inorgánicos que le aportan alta dureza y resistencia mecánica. Al otro lado, incorpora una placa RESIST de 13 mm que con mayor cantidad de fibra de vidrio y dosificación modificada, aumenta su densidad, mejorando notablemente la resistencia mecánica. Idónea para lugares con altas exigencias en cuanto a deterioro y desgaste. Reacción al fuego: EUROCLASE A1. Sistema de galces desiguales: las placas encajan entre ellas dejando una entrecalle de 3 mm por donde se inserta la pasta de juntas. Este sistema no utiliza cinta de papel. La pasta de juntas se aplica en las cavidades de las placas y una masilla elástica en los encuentros. Atornillada a cada lado de una estructura metálica de acero galvanizado formada por canales de 50 mm y montantes de 51x99x49 mm con una modulación de 400 mm entre ejes, dando un ancho total de tabique de 125 mm. Incluida parte proporcional del resto de materiales: tornillería, pasta de juntas, masilla para encuentros perimetrales, fijaciones, junta estanca, etc. Montaje según norma de instalación UNE 102043 y exigencias del CTE.","Tabique mixto formado por una placa BASIC de 13 mm de espesor compuesta por yeso natural, fibra de vidrio y aditivos inorgánicos que le aportan alta dureza y resistencia mecánica. Al otro lado, incorpora una placa HIDROPLUS de 13 mm con tratamiento hidrófugo y un aumento en su densidad, características claves para una elevada resistencia a la humedad (absorción de agua menor al 3%) y una gran resistencia mecánica. Idónea para zonas de intemperie. Reacción al fuego: EUROCLASE A1. Sistema de galces desiguales: las placas encajan entre ellas dejando una entrecalle de 3 mm por donde se inserta la pasta de juntas. Este sistema no utiliza cinta de papel. La pasta de juntas se aplica en las cavidades de las placas y una masilla elástica en los encuentros. Atornillada a cada lado de una estructura metálica de acero galvanizado formada por canales de 50 mm y montantes de 51x99x49 mm con una modulación de 400 mm entre ejes, dando un ancho total de tabique de 125 mm. Incluida parte proporcional del resto de materiales: tornillería, pasta de juntas, masilla para encuentros perimetrales, fijaciones, junta estanca, etc. Montaje según norma de instalación UNE 102043 y exigencias del CTE.","Tabique mixto formado por una placa BASIC de 13 mm de espesor compuesta por yeso natural, fibra de vidrio y aditivos inorgánicos que le aportan alta dureza y resistencia mecánica. Al otro lado, incorpora una placa SUPREM de 13 mm con tratamiento hidrófugo, perlita y un aumento en la densidad para conseguir soluciones constructivas que cumplan, altos requisitos frente al fuego y una capacidad reducida de absorción de agua. Reacción al fuego: EUROCLASE A1. Sistema de galces desiguales: las placas encajan entre ellas dejando una entrecalle de 3 mm por donde se inserta la pasta de juntas. Este sistema no utiliza cinta de papel. La pasta de juntas se aplica en las cavidades de las placas y una masilla elástica en los encuentros. Atornillada a cada lado de una estructura metálica de acero galvanizado formada por canales de 50 mm y montantes de 51x99x49 mm con una modulación de 400 mm entre ejes, dando un ancho total de tabique de 125 mm. Incluida parte proporcional del resto de materiales: tornillería, pasta de juntas, masilla para encuentros perimetrales, fijaciones, junta estanca, etc. Montaje según norma de instalación UNE 102043 y exigencias del CTE."]
[null,null,49975,"2.1.17","TABIQUE MIXTO ATT® 129/400 (99)  [15+99+15]",400,99,15,"-","Tabique mixto formado por una placa BASIC de 15 mm de espesor compuesta por yeso natural, fibra de vidrio y aditivos inorgánicos que le aportan alta dureza y resistencia mecánica. Al otro lado, incorpora una placa HIDRO de 15 mm con tratamiento hidrófugo, disminuyendo así su capacidad de absorción de agua (menor al 5%). Idónea para proteger las estancias de los efectos adversos de la humedad. Reacción al fuego: EUROCLASE A1. Sistema de galces desiguales: las placas encajan entre ellas dejando una entrecalle de 3 mm por donde se inserta la pasta de juntas. Este sistema no utiliza cinta de papel. La pasta de juntas se aplica en las cavidades de las placas y una masilla elástica en los encuentros. Atornillada a cada lado de una estructura metálica de acero galvanizado formada por canales de 50 mm y montantes de 51x99x49 mm con una modulación de 400 mm entre ejes, dando un ancho total de tabique de 129 mm. Incluida parte proporcional del resto de materiales: tornillería, pasta de juntas, masilla para encuentros perimetrales, fijaciones, junta estanca, etc. Montaje según norma de instalación UNE 102043 y exigencias del CTE.","Tabique mixto formado por una placa BASIC de 15 mm de espesor compuesta por yeso natural, fibra de vidrio y aditivos inorgánicos que le aportan alta dureza y resistencia mecánica. Al otro lado, incorpora una placa FUEGO de 15 mm con perlita y un aumento en la densidad que la hace idónea para un excelente comportamiento y resistencia frente al fuego. Reacción al fuego: EUROCLASE A1. Sistema de galces desiguales: las placas encajan entre ellas dejando una entrecalle de 3 mm por donde se inserta la pasta de juntas. Este sistema no utiliza cinta de papel. La pasta de juntas se aplica en las cavidades de las placas y una masilla elástica en los encuentros. Atornillada a cada lado de una estructura metálica de acero galvanizado formada por canales de 50 mm y montantes de 51x99x49 mm con una modulación de 400 mm entre ejes, dando un ancho total de tabique de 129 mm. Incluida parte proporcional del resto de materiales: tornillería, pasta de juntas, masilla para encuentros perimetrales, fijaciones, junta estanca, etc. Montaje según norma de instalación UNE 102043 y exigencias del CTE.","Tabique mixto formado por una placa BASIC de 15 mm de espesor compuesta por yeso natural, fibra de vidrio y aditivos inorgánicos que le aportan alta dureza y resistencia mecánica. Al otro lado, incorpora una placa RESIST de 15 mm que con mayor cantidad de fibra de vidrio y dosificación modificada, aumenta su densidad, mejorando notablemente la resistencia mecánica. Idónea para lugares con altas exigencias en cuanto a deterioro y desgaste. Reacción al fuego: EUROCLASE A1. Sistema de galces desiguales: las placas encajan entre ellas dejando una entrecalle de 3 mm por donde se inserta la pasta de juntas. Este sistema no utiliza cinta de papel. La pasta de juntas se aplica en las cavidades de las placas y una masilla elástica en los encuentros. Atornillada a cada lado de una estructura metálica de acero galvanizado formada por canales de 50 mm y montantes de 51x99x49 mm con una modulación de 400 mm entre ejes, dando un ancho total de tabique de 129 mm. Incluida parte proporcional del resto de materiales: tornillería, pasta de juntas, masilla para encuentros perimetrales, fijaciones, junta estanca, etc. Montaje según norma de instalación UNE 102043 y exigencias del CTE.","Tabique mixto formado por una placa BASIC de 15 mm de espesor compuesta por yeso natural, fibra de vidrio y aditivos inorgánicos que le aportan alta dureza y resistencia mecánica. Al otro lado, incorpora una placa HIDROPLUS de 15 mm con tratamiento hidrófugo y un aumento en su densidad, características claves para una elevada resistencia a la humedad (absorción de agua menor al 3%) y una gran resistencia mecánica. Idónea para zonas de intemperie. Reacción al fuego: EUROCLASE A1. Sistema de galces desiguales: las placas encajan entre ellas dejando una entrecalle de 3 mm por donde se inserta la pasta de juntas. Este sistema no utiliza cinta de papel. La pasta de juntas se aplica en las cavidades de las placas y una masilla elástica en los encuentros. Atornillada a cada lado de una estructura metálica de acero galvanizado formada por canales de 50 mm y montantes de 51x99x49 mm con una modulación de 400 mm entre ejes, dando un ancho total de tabique de 129 mm. Incluida parte proporcional del resto de materiales: tornillería, pasta de juntas, masilla para encuentros perimetrales, fijaciones, junta estanca, etc. Montaje según norma de instalación UNE 102043 y exigencias del CTE.","Tabique mixto formado por una placa BASIC de 15 mm de espesor compuesta por yeso natural, fibra de vidrio y aditivos inorgánicos que le aportan alta dureza y resistencia mecánica. Al otro lado, incorpora una placa SUPREM de 15 mm con tratamiento hidrófugo, perlita y un aumento en la densidad para conseguir soluciones constructivas que cumplan, altos requisitos frente al fuego y una capacidad reducida de absorción de agua. Reacción al fuego: EUROCLASE A1. Sistema de galces desiguales: las placas encajan entre ellas dejando una entrecalle de 3 mm por donde se inserta la pasta de juntas. Este sistema no utiliza cinta de papel. La pasta de juntas se aplica en las cavidades de las placas y una masilla elástica en los encuentros. Atornillada a cada lado de una estructura metálica de acero galvanizado formada por canales de 50 mm y montantes de 51x99x49 mm con una modulación de 400 mm entre ejes, dando un ancho total de tabique de 129 mm. Incluida parte proporcional del resto de materiales: tornillería, pasta de juntas, masilla para encuentros perimetrales, fijaciones, junta estanca, etc. Montaje según norma de instalación UNE 102043 y exigencias del CTE."]
[null,null,50000,"2.1.18","TABIQUE MIXTO ATT® 139/400 (99)  [20+99+20]",400,99,20,"-","Tabique mixto formado por una placa BASIC de 20 mm de espesor compuesta por yeso natural, fibra de vidrio y aditivos inorgánicos que le aportan alta dureza y resistencia mecánica. Al otro lado, incorpora una placa HIDRO de 20 mm con tratamiento hidrófugo, disminuyendo así su capacidad de absorción de agua (menor al 5%). Idónea para proteger las estancias de los efectos adversos de la humedad. Reacción al fuego: EUROCLASE A1. Sistema de galces desiguales: las placas encajan entre ellas dejando una entrecalle de 3 mm por donde se inserta la pasta de juntas. Este sistema no utiliza cinta de papel. La pasta de juntas se aplica en las cavidades de las placas y una masilla elástica en los encuentros. Atornillada a cada lado de una estructura metálica de acero galvanizado formada por canales de 50 mm y montantes de 51x99x49 mm con una modulación de 400 mm entre ejes, dando un ancho total de tabique de 139 mm. Incluida parte proporcional del resto de materiales: tornillería, pasta de juntas, masilla para encuentros perimetrales, fijaciones, junta estanca, etc. Montaje según norma de instalación UNE 102043 y exigencias del CTE.","Tabique mixto formado por una placa BASIC de 20 mm de espesor compuesta por yeso natural, fibra de vidrio y aditivos inorgánicos que le aportan alta dureza y resistencia mecánica. Al otro lado, incorpora una placa FUEGO de 20 mm con perlita y un aumento en la densidad que la hace idónea para un excelente comportamiento y resistencia frente al fuego. Reacción al fuego: EUROCLASE A1. Sistema de galces desiguales: las placas encajan entre ellas dejando una entrecalle de 3 mm por donde se inserta la pasta de juntas. Este sistema no utiliza cinta de papel. La pasta de juntas se aplica en las cavidades de las placas y una masilla elástica en los encuentros. Atornillada a cada lado de una estructura metálica de acero galvanizado formada por canales de 50 mm y montantes de 51x99x49 mm con una modulación de 400 mm entre ejes, dando un ancho total de tabique de 139 mm. Incluida parte proporcional del resto de materiales: tornillería, pasta de juntas, masilla para encuentros perimetrales, fijaciones, junta estanca, etc. Montaje según norma de instalación UNE 102043 y exigencias del CTE.","Tabique mixto formado por una placa BASIC de 20 mm de espesor compuesta por yeso natural, fibra de vidrio y aditivos inorgánicos que le aportan alta dureza y resistencia mecánica. Al otro lado, incorpora una placa RESIST de 20 mm que con mayor cantidad de fibra de vidrio y dosificación modificada, aumenta su densidad, mejorando notablemente la resistencia mecánica. Idónea para lugares con altas exigencias en cuanto a deterioro y desgaste. Reacción al fuego: EUROCLASE A1. Sistema de galces desiguales: las placas encajan entre ellas dejando una entrecalle de 3 mm por donde se inserta la pasta de juntas. Este sistema no utiliza cinta de papel. La pasta de juntas se aplica en las cavidades de las placas y una masilla elástica en los encuentros. Atornillada a cada lado de una estructura metálica de acero galvanizado formada por canales de 50 mm y montantes de 51x99x49 mm con una modulación de 400 mm entre ejes, dando un ancho total de tabique de 139 mm. Incluida parte proporcional del resto de materiales: tornillería, pasta de juntas, masilla para encuentros perimetrales, fijaciones, junta estanca, etc. Montaje según norma de instalación UNE 102043 y exigencias del CTE.","Tabique mixto formado por una placa BASIC de 20 mm de espesor compuesta por yeso natural, fibra de vidrio y aditivos inorgánicos que le aportan alta dureza y resistencia mecánica. Al otro lado, incorpora una placa HIDROPLUS de 20 mm con tratamiento hidrófugo y un aumento en su densidad, características claves para una elevada resistencia a la humedad (absorción de agua menor al 3%) y una gran resistencia mecánica. Idónea para zonas de intemperie. Reacción al fuego: EUROCLASE A1. Sistema de galces desiguales: las placas encajan entre ellas dejando una entrecalle de 3 mm por donde se inserta la pasta de juntas. Este sistema no utiliza cinta de papel. La pasta de juntas se aplica en las cavidades de las placas y una masilla elástica en los encuentros. Atornillada a cada lado de una estructura metálica de acero galvanizado formada por canales de 50 mm y montantes de 51x99x49 mm con una modulación de 400 mm entre ejes, dando un ancho total de tabique de 139 mm. Incluida parte proporcional del resto de materiales: tornillería, pasta de juntas, masilla para encuentros perimetrales, fijaciones, junta estanca, etc. Montaje según norma de instalación UNE 102043 y exigencias del CTE.","Tabique mixto formado por una placa BASIC de 20 mm de espesor compuesta por yeso natural, fibra de vidrio y aditivos inorgánicos que le aportan alta dureza y resistencia mecánica. Al otro lado, incorpora una placa SUPREM de 20 mm con tratamiento hidrófugo, perlita y un aumento en la densidad para conseguir soluciones constructivas que cumplan, altos requisitos frente al fuego y una capacidad reducida de absorción de agua. Reacción al fuego: EUROCLASE A1. Sistema de galces desiguales: las placas encajan entre ellas dejando una entrecalle de 3 mm por donde se inserta la pasta de juntas. Este sistema no utiliza cinta de papel. La pasta de juntas se aplica en las cavidades de las placas y una masilla elástica en los encuentros. Atornillada a cada lado de una estructura metálica de acero galvanizado formada por canales de 50 mm y montantes de 51x99x49 mm con una modulación de 400 mm entre ejes, dando un ancho total de tabique de 139 mm. Incluida parte proporcional del resto de materiales: tornillería, pasta de juntas, masilla para encuentros perimetrales, fijaciones, junta estanca, etc. Montaje según norma de instalación UNE 102043 y exigencias del CTE."]

{"sheet":"Tabique sencillo","index":6,"n_rows":151,"n_cols":60,"rows_kept":151,"cut":false,"hidden":false,"merged":[[26,59,27,59],[6,2,6,51],[25,28,25,29],[37,38,38,42],[37,14,37,16],[25,56,26,56],[25,52,25,55],[25,36,25,37],[25,38,25,39],[47,9,48,9],[47,10,48,10],[47,8,48,8],[25,24,25,27],[25,20,25,21],[25,12,25,14],[25,15,25,16],[25,17,25,19]]}
[null,null,"                     RENDIMIENTOS"]
[null,null,"                     PEDIDO MATERIALES"]
[null,null,"                     PRESUPUESTO"]
[null,null,"                     LISTA DE MATERIALES"]
[null,null,null,{"$f":"VLOOKUP(BE36,'Índice sistemas'!C5:E22,3,FALSE)","v":"TABIQUE ATT® 75/600 (49)  [13+49+13]"},null,null,null,null,null,null,null,null,{"$f":"$D$5","v":"TABIQUE ATT® 75/600 (49)  [13+49+13]"},null,null,null,null,null,null,null,{"$f":"$D$5","v":"TABIQUE ATT® 75/600 (49)  [13+49+13]"},null,null,null,null,null,null,null,{"$f":"$D$5","v":"TABIQUE ATT® 75/600 (49)  [13+49+13]"},null,null,null,null,null,null,null,{"$f":"AC5","v":"TABIQUE ATT® 75/600 (49)  [13+49+13]"},null,null,null,null,null,null,null,{"$f":"AK5","v":"TABIQUE ATT® 75/600 (49)  [13+49+13]"}]
[]
[null,null,{"$f":"VLOOKUP(BE36,'Índice sistemas'!C:N,(BE29+6),FALSE)","v":"Tabique formado por una placa BASIC de 13 mm de espesor compuesta por yeso natural, fibra de vidrio y aditivos inorgánicos que le aportan alta dureza y resistencia mecánica. Reacción al fuego: EUROCLASE A1. Sistema de galces desiguales: las placas encajan entre ellas dejando una entrecalle de 3 mm por donde se inserta la pasta de juntas. Este sistema no utiliza cinta de papel. La pasta de juntas se aplica en las cavidades de las placas y una masilla elástica en los encuentros. Atornillada a cada lado de una estructura metálica de acero galvanizado formada por canales de 50 mm y montantes de 51x49x49 mm con una modulación de 600 mm entre ejes, dando un ancho total de tabique de 75 mm. Incluida parte proporcional del resto de materiales: tornillería, pasta de juntas, masilla para encuentros perimetrales, fijaciones, junta estanca, etc. Montaje según norma de instalación UNE 102043 y exigencias del CTE."}]
[{"$f":"Datos!A15","v":"clientes@elalteron.com"},null,{"$f":"IF(B10=B106,C106,IF(B10=B107,C107,C108))","v":"Totalmente finalizado con nivel de acabado Q3"}]
["CODIFICACIÓN MANO OBRA"]
[{"$f":"IF(B10=\"Q2\",2,IF(B10=\"Q3\",3,4))","v":3},"Q3","INTRODUCIR ACABADO DESEADO"]
[]
[{"$f":"B12/10","v":60},600,"INTRODUCIR MODULACIÓN "]
[]
[{"$f":"SUM(A10:A13)","v":63},1,"INTRODUCIR CANTIDAD m2"]
["PESTAÑA DATOS"]
[{"$f":"Datos!A6","v":30}]
[{"$f":"Datos!A7","v":30}]
[{"$f":"Datos!A8","v":30}]
[{"$f":"Datos!A9","v":30},null,"Material calculado para ",null,null,null,null,null,null,null,null,null,null,null,null,null,null,null,null,null,{"$f":"B14","v":1},"m2",null,null,null,null,null,null,{"$f":"B14","v":1},"m2"]
[{"$f":"Datos!A10","v":30}]
[{"$f":"Datos!A11","v":20}]
[{"$f":"Datos!A12","v":"pedidos@elalteron.com"}]
[{"$f":"Datos!A13","v":"repuesto@elalteron.com"},null,null,null,null,null,null,null,null,null,null,null,null,null,null,null,null,null,null,null,null,null,null,null,null,null,null,null,null,null,null,null,null,null,null,null,null,null,null,null,null,null,null,null,"Precio",{"$f":"AS5","v":"TABIQUE ATT® 75/600 (49)  [13+49+13]"},null,null,null,null,32.628,"€/m2"]
[{"$f":"Datos!A14","v":"compras@elalteron.com"},null,null,null,null,null,null,null,null,null,null,null,null,null,null,null,null,null,null,null,null,null,null,null,null,null,null,null,null,null,null,null,null,null,null,null,null,null,null,null,null,null,null,null,"Cantidad de sistema",null,null,null,null,null,1,"m2"]
[{"$f":"IF(B10=\"Q2\",0,'Tabique sencillo'!A18)","v":30},null,null,null,null,null,null,null,null,null,null,null,null,null,null,null,null,null,null,null,null,null,null,null,null,null,null,null,null,null,null,null,null,null,null,null,null,null,null,null,null,null,null,null,"TOTAL",null,null,null,null,null,{"$f":"AY23*AY24","v":32.628},"€"]
["MULTIPLICADOR",null,null,"UD de MEDIDA","RENDIMIENTO","CANTIDAD","CANTIDAD",null,"DESCUENTO","REPERCUSIÓN"," TOTAL",null,"TOTAL PIEZAS",null,null,"DESGLOSE",null,"REDONDEADO ",null,null,"TOTAL PIEZAS",null,"PRECIO","DESCUENTO","DESGLOSE EN PIEZAS",null,null,null,"REDONDEADO ",null,"PRECIO","DESCUENTO",null,null,null,null,"TOTAL PIEZAS",null,"DESGLOSE",null,null,null,null,null,null,null,null,null,null,null,null,null,"DATOS DE LISTADO Y RENDIMIENTOS",null,null,null,"SISTEMA"]
["TRASDOSADO","CÓDIGO","MATERIALES","UD","UD/m2","UD","€ / UD",null,"%","€/m2","€",null,"CANTIDAD","€/UD","UD","PAQ/PAL","PIEZAS","CANTIDAD","€","UD","CANTIDAD","UD","€/UD","%",null,null,null,null,"CANTIDAD","UD","€/UD","%",null,null,null,null,"CANTIDAD","UD","PAQ/PAL","PIEZAS",null,null,null,null,null,null,null,null,null,null,null,null,"ALTO","LARGO","UNI.CAJA","CAJAS/PALE",null,"Id tipo placa ","Id columnas","Tipo"]
[2,{"$f":"VLOOKUP(C28,Listado!$B$4:$D$30,2,FALSE)","v":"040113"},"PLACA ATT BASIC 13X600X1200 (78)","m2",{"$f":"A28*Rendimientos!E6","v":2.04},{"$f":"$B$14*E28","v":2.04},{"$f":"VLOOKUP(B28,Listado!$A$5:$I$54,9,FALSE)","v":6.36},1,{"$f":"H28*A16","v":30},{"$f":"ROUND(E28*G28*(1-I28/100),2)","v":9.08},{"$f":"J28*$B$14","v":9.08},null,{"$f":"ROUNDUP(($B$14*E28)/(BA28*BB28),0)","v":3},{"$f":"ROUND(VLOOKUP(B28,Listado!A:I,9,FALSE)*(BA28*BB28),2)","v":4.58},"PLACAS",{"$f":"INT(M28/($BC$28*$BD$28))","v":0},{"$f":"M28-P28*$BC$28*$BD$28","v":3},{"$f":"ROUNDUP(($B$14*E28)/(BA28*BB28*BC28*BD28),0)","v":1},{"$f":"$N$28*R28*$BD$28","v":357.24},"PALETS",{"$f":"M28","v":3},"PLACAS",{"$f":"N28","v":4.58},{"$f":"I28","v":30},{"$f":"INT(U28/($BC$28*$BD$28))","v":0},"PALETS",{"$f":"U28-Y28*$BC$28*$BD$28","v":3},"PLACAS",{"$f":"R28","v":1},{"$f":"T28","v":"PALETS"},{"$f":"$N$28*$BD$28","v":357.24},{"$f":"X28","v":30},null,null,null,null,{"$f":"U28","v":3},"PLACAS",{"$f":"INT(AK28/($BC$28*$BD$28))","v":0},{"$f":"AK28-AM28*$BC$28*$BD$28","v":3},null,null,null,null,null,null,null,null,null,null,null,null,{"$f":"VLOOKUP($B28,Listado!$A$5:$I$54,5,FALSE)","v":0.6},{"$f":"VLOOKUP($B28,Listado!$A$5:$I$54,6,FALSE)","v":1.2},{"$f":"VLOOKUP($B28,Listado!$A$5:$I$54,7,FALSE)","v":1},{"$f":"VLOOKUP($B28,Listado!$A$5:$I$54,8,FALSE)","v":78},{"$f":"RIGHT(B28,2)","v":"13"},"en código alt","hoja \"Sistema\""]
[1,{"$f":"IF(BE30=\"49\",48115030,IF(BE30=\"74\",\"48117530\",\"481110030\"))","v":48115030},{"$f":"VLOOKUP(B29,Listado!$A$5:$B$54,2,FALSE)","v":"CANAL 50X3000 (8u x 16p)"},"ml",{"$f":"A29*Rendimientos!E7","v":0.8},{"$f":"$B$14*E29","v":0.8},{"$f":"VLOOKUP(B29,Listado!$A$5:$I$54,9,FALSE)","v":3.55},1,{"$f":"H29* A17","v":30},{"$f":"ROUND(E29*G29*(1-I29/100),2)","v":1.99},1.99,null,{"$f":"ROUNDUP(($B$14*E29)/(BB29),0)","v":1},{"$f":"ROUND(VLOOKUP(B29,Listado!A:I,9,FALSE)*BB29,2)","v":10.65},"PERFILES",{"$f":"INT(M29/$BC$29)","v":0},{"$f":"M29-P29*$BC$29","v":1},{"$f":"ROUNDUP(($B$14*E29)/(BB29*BC29),0)","v":1},{"$f":"R29*$BC$29*$N$29","v":85.2},"PAQUETES",{"$f":"M29","v":1},"PERFILES",10.65,{"$f":"I29","v":30},{"$f":"INT(U29/$BC$29)","v":0},"PAQUETES",{"$f":"U29-Y29*$BC$29","v":1},"PERFILES",{"$f":"R29","v":1},"PAQUETES",{"$f":"$BC$29*$N$29","v":85.2},{"$f":"X29","v":30},null,null,null,null,{"$f":"U29","v":1},"PERFILES",{"$f":"INT(AK29/$BC$29)","v":0},{"$f":"AK29-AM29*$BC$29","v":1},null,null,null,null,null,null,null,null,null,null,null,null,{"$f":"VLOOKUP($B29,Listado!$A$5:$I$54,5,FALSE)","v":0},{"$f":"VLOOKUP($B29,Listado!$A$5:$I$54,6,FALSE)","v":3},{"$f":"VLOOKUP($B29,Listado!$A$5:$I$54,7,FALSE)","v":8},{"$f":"VLOOKUP($B29,Listado!$A$5:$I$54,8,FALSE)","v":16},{"$f":"LEFT(RIGHT(B28,3),1)","v":"1"},1,7,"Basic"]
[1,{"$f":"VLOOKUP(C30,Listado!$B$5:$C$54,2,FALSE)","v":"48104930"},"MONTANTE 49X3000 (8u x 16p)","ml",{"$f":"IF(B12=600,A30*Rendimientos!E9,A30*Rendimientos!E8)","v":2.1},{"$f":"$B$14*E30","v":2.1},{"$f":"VLOOKUP(B30,Listado!$A$5:$I$54,9,FALSE)","v":4.54},1,{"$f":"H30* A17","v":30},{"$f":"ROUND(E30*G30*(1-I30/100),2)","v":6.67},6.67,null,{"$f":"ROUNDUP(($B$14*E30)/(BB30),0)","v":1},{"$f":"ROUND(VLOOKUP(B30,Listado!A:I,9,FALSE)*BB30,2)","v":13.62},"PERFILES",{"$f":"INT(M30/$BC$30)","v":0},{"$f":"M30-P30*$BC$30","v":1},{"$f":"ROUNDUP(($B$14*E30)/(BB30*BC30),0)","v":1},{"$f":"R30*$BC$30*$N$30","v":108.96},"PAQUETES",{"$f":"M30","v":1},"PERFILES",13.62,{"$f":"I30","v":30},{"$f":"INT(U30/$BC$30)","v":0},"PAQUETES",{"$f":"U30-Y30*$BC$30","v":1},"PERFILES",{"$f":"R30","v":1},"PAQUETES",{"$f":"$BC$30*$N$30","v":108.96},30,null,null,null,null,1,"PERFILES",{"$f":"INT(AK30/$BC$30)","v":0},{"$f":"AK30-AM30*$BC$30","v":1},null,null,null,null,null,null,null,null,null,null,null,null,{"$f":"VLOOKUP($B30,Listado!$A$5:$I$54,5,FALSE)","v":0},{"$f":"VLOOKUP($B30,Listado!$A$5:$I$54,6,FALSE)","v":3},{"$f":"VLOOKUP($B30,Listado!$A$5:$I$54,7,FALSE)","v":8},{"$f":"VLOOKUP($B30,Listado!$A$5:$I$54,8,FALSE)","v":16},{"$f":"LEFT(RIGHT(B30,4),2)","v":"49"},2,8,"Hidro"]
[2,{"$f":"IF(BE28=\"20\",\"4802010135\",\"4802010125\")","v":"4802010125"},{"$f":"VLOOKUP(B31,Listado!$A$5:$B$54,2,FALSE)","v":"TORNILLOS ATT PP 3,5X25 (1000)"},"ud",{"$f":"IF(B12=600,A31*Rendimientos!E16,A31*Rendimientos!E10)","v":28},28,{"$f":"ROUND(VLOOKUP(B31,Listado!$A$5:$I$54,9,FALSE)/BA31,2)","v":0.03},1,{"$f":"H31* A19","v":30},0.59,0.59,null,{"$f":"ROUNDUP(($B$14*E31)/(BC31),0)","v":1},{"$f":"VLOOKUP(B31,Listado!A:I,9,FALSE)","v":29.06},"CAJAS",{"$f":"($B$14*E31)/(BC31)","v":2.8000000000000001E-2},"CAJAS",{"$f":"M31","v":1},{"$f":"R31*$N$31","v":29.06},{"$f":"O31","v":"CAJAS"},1,"CAJAS",29.06,30,null,null,{"$f":"U31","v":1},"CAJAS",1,"CAJAS",{"$f":"$N$31","v":29.06},30,null,null,null,null,1,"CAJAS",null,null,null,null,null,null,null,null,null,null,null,null,null,null,{"$f":"VLOOKUP($B31,Listado!$A$5:$I$54,5,FALSE)","v":1000},{"$f":"VLOOKUP($B31,Listado!$A$5:$I$54,6,FALSE)","v":0},{"$f":"Rendimientos!F10","v":1000},null,{"$f":"IF(BE29=\"1\",1,IF(BE29=\"2\",2,IF(BE29=\"3\",3,IF(BE29=\"4\",4,IF(BE29=\"5\",5,6)))))","v":1},3,9,"Fuego"]
[1,{"$f":"Rendimientos!A22","v":"480903T03"},{"$f":"VLOOKUP(B32,Listado!$A$5:$B$54,2,FALSE)","v":"TACO RAPIDO ALTERON 5X30 (100u)"},"ud",{"$f":"A32*Rendimientos!E22","v":2},2,{"$f":"ROUND(VLOOKUP(B32,Listado!$A$5:$I$54,9,FALSE)/Rendimientos!F22,2)","v":0.11},1,{"$f":"H32* A19","v":30},0.15,0.15,null,{"$f":"ROUNDUP(($B$14*E32)/(BC32),0)","v":1},{"$f":"VLOOKUP(B32,Listado!A:I,9,FALSE)","v":10.53},"CAJAS",{"$f":"($B$14*E32)/(BC32)","v":0.02},"CAJAS",1,{"$f":"R32*$N$32","v":10.53},{"$f":"O32","v":"CAJAS"},1,"CAJAS",10.53,30,null,null,{"$f":"U32","v":1},"CAJAS",1,"CAJAS",{"$f":"$N$32","v":10.53},30,null,null,null,null,1,"CAJAS",null,null,null,null,null,null,null,null,null,null,null,null,null,null,{"$f":"VLOOKUP($B32,Listado!$A$5:$I$54,5,FALSE)","v":0},{"$f":"VLOOKUP($B32,Listado!$A$5:$I$54,6,FALSE)","v":0},{"$f":"Rendimientos!F22","v":100},null,{"$f":"B12","v":600},4,10,"Resist"]
[2,{"$f":"VLOOKUP(C33,Listado!$B$5:$C$54,2,FALSE)","v":"0470010110"},"PASTA ATT JUNTAS 10KG 60 MIN (56)","kg",{"$f":"A33*Rendimientos!E25","v":0.22},0.22,{"$f":"ROUND(VLOOKUP(B33,Listado!$A$5:$I$54,9,FALSE)/Rendimientos!F25,2)","v":1.99},1,{"$f":"H33* A18","v":30},0.31,0.31,null,{"$f":"ROUNDUP(($B$14*E33)/(BC33),0)","v":1},{"$f":"VLOOKUP(B33,Listado!A:I,9,FALSE)","v":19.850000000000001},"SACOS",{"$f":"($B$14*E33)/(BC33)","v":2.1999999999999999E-2},"SACOS",1,{"$f":"R33*$N$33","v":19.850000000000001},"SACOS",1,"SACOS",19.850000000000001,30,null,null,{"$f":"U33","v":1},"SACOS",1,"SACOS",{"$f":"$N$33","v":19.850000000000001},30,null,null,null,null,1,"SACOS",null,null,null,null,null,null,null,null,null,null,null,null,null,null,{"$f":"VLOOKUP($B33,Listado!$A$5:$I$54,5,FALSE)","v":0},{"$f":"VLOOKUP($B33,Listado!$A$5:$I$54,6,FALSE)","v":0},{"$f":"Rendimientos!F25","v":10},null,null,5,11,"Hidroplus"]
[2,"48040101",{"$f":"VLOOKUP(B34,Listado!$A$5:$B$54,2,FALSE)","v":"MASILLA PARA ENCUENTROS ATT"},"mil",{"$f":"A34*Rendimientos!$E$23","v":20},{"$f":"$B$14*E34","v":20},{"$f":"VLOOKUP(B34,Listado!$A$5:$I$54,9,FALSE)","v":2.4199999999999999E-2},1,{"$f":"H34* A19","v":30},0.34,0.34,null,{"$f":"ROUNDUP(($B$14*E34)/(BC34),0)","v":1},{"$f":"VLOOKUP(B34,Listado!A:J,10,FALSE)","v":7.26},"BOTES",{"$f":"($B$14*E34)/(BC34)","v":6.6666666666666666E-2},{"$f":"O34","v":"BOTES"},1,{"$f":"R34*$N$34","v":7.26},{"$f":"O34","v":"BOTES"},1,{"$f":"T34","v":"BOTES"},7.26,30,null,null,{"$f":"U34","v":1},{"$f":"V34","v":"BOTES"},1,"BOTES",{"$f":"$N$34","v":7.26},30,null,null,null,null,1,{"$f":"AD34","v":"BOTES"},null,null,null,null,null,null,null,null,null,null,null,null,null,null,{"$f":"VLOOKUP($B34,Listado!$A$5:$I$54,5,FALSE)","v":0},{"$f":"VLOOKUP($B34,Listado!A:I,6,FALSE)","v":0},{"$f":"Rendimientos!F23","v":300},null,null,6,12,"Suprem"]
[1,{"$f":"IF(BE30=\"49\",\"48010348\",IF(BE30=\"74\",\"48010370\",\"48010390\"))","v":"48010348"},{"$f":"VLOOKUP(B35,Listado!$A$5:$B$54,2,FALSE)","v":"JUNTA ESTANCA ATT 50MM (30ML)"},"ml",{"$f":"A35*Rendimientos!E24","v":0.8},0.8,{"$f":"ROUND(VLOOKUP(B35,Listado!$A$5:$I$54,9,FALSE)/Rendimientos!F24,2)","v":0.55000000000000004},1,{"$f":"H35* A20","v":30},0.31,0.31,null,{"$f":"ROUNDUP(($B$14*E35)/(BC35),0)","v":1},{"$f":"VLOOKUP(B35,Listado!A:I,9,FALSE)","v":16.59},"ROLLOS",{"$f":"($B$14*E35)/(BC35)","v":2.6666666666666668E-2},"ROLLOS",1,{"$f":"R35*$N$35","v":16.59},{"$f":"O35","v":"ROLLOS"},1,"ROLLOS",16.59,30,null,null,{"$f":"U35","v":1},"ROLLOS",1,"ROLLOS",{"$f":"$N$35","v":16.59},30,null,null,null,null,1,"ROLLOS",null,null,null,null,null,null,null,null,null,null,null,null,null,null,{"$f":"VLOOKUP($B35,Listado!$A$5:$I$54,5,FALSE)","v":0},{"$f":"VLOOKUP($B35,Listado!$A$5:$I$54,6,FALSE)","v":0},{"$f":"Rendimientos!F24","v":30}]
[2,{"$f":"IF(A10=3,\"\",Rendimientos!A27)","v":""},{"$f":"IFERROR(VLOOKUP(B36,Listado!A5:B54,2,FALSE),\"\")","v":""},{"$f":"IF(B10=\"Q3\",\"\",\"kg\")","v":""},{"$f":"IF(B10=\"Q3\",\"\",IF(B10=\"Q3\",A36*Rendimientos!E26,IF(B10=\"Q4\",A36*Rendimientos!E27)))","v":""},{"$f":"IF(B10=\"Q3\",\"\",$B$14*E36)","v":""},{"$f":"IFERROR(ROUND(VLOOKUP(B36,Listado!$A$5:$I$54,9,FALSE)/Rendimientos!F26,2),\"\")","v":""},1,{"$f":"H36* A18","v":30},{"$f":"IFERROR(ROUND(E36*G36*(1-I36/100),2),0)","v":0},{"$f":"IFERROR(J36*$B$14,0)","v":0},null,{"$f":"IFERROR(ROUNDUP(($B$14*E36)/(BC36),0),\"0\")","v":"0"},{"$f":"IFERROR(VLOOKUP(B36,Listado!A:I,9,FALSE),\"0\")","v":"0"},{"$f":"IF(B10=\"Q2\",\"\",\"SACOS\")","v":"SACOS"},{"$f":"IFERROR(($B$14*E36)/(BC36),\"0\")","v":"0"},{"$f":"IF(B10=\"Q2\",\"\",\"SACOS\")","v":"SACOS"},"0",{"$f":"IFERROR(R36*$N$36,\"\")","v":0},{"$f":"IF(B10=\"Q2\",\"\",\"SACOS\")","v":"SACOS"},{"$f":"M36","v":"0"},{"$f":"IF(B10=\"Q2\",\" \",\"SACOS\")","v":"SACOS"},"0",{"$f":"I36","v":30},null,null,{"$f":"IF(U36=\"\",\"\",U36)","v":"0"},{"$f":"IF(B10=\"Q2\",\" \",\"SACOS\")","v":"SACOS"},{"$f":"R36","v":"0"},"SACOS",{"$f":"IFERROR($N$36,\"\")","v":"0"},30,null,null,null,null,"0",{"$f":"IF(B10=\"Q2\",\" \",\"SACOS\")","v":"SACOS"},null,null,null,null,null,null,null,null,null,null,null,null,null,null,{"$f":"VLOOKUP($B36,Listado!$A$5:$I$54,5,FALSE)","v":{"$error":"#N/A"}},{"$f":"VLOOKUP($B36,Listado!$A$5:$I$54,8,FALSE)","v":{"$error":"#N/A"}},{"$f":"Rendimientos!F27","v":10},null,{"$f":"BE32*100+BE30*100+BE28*2","v":64926}]
[]
[null,null,null,null,null,null,null,null,"Total material",{"$f":"SUM(J28:J36)","v":19.439999999999998},{"$f":"SUM(K28:K36)","v":19.439999999999998},null,"Total (€)",{"$f":"SUMPRODUCT(M28:M36,N28:N36)","v":121.3},null,null,null,"Total (€)",{"$f":"SUM(S28:S36)","v":634.68999999999994},null,"Total (€)",{"$f":"SUMPRODUCT(U28:U36,W28:W36)","v":121.3},null,null,null,null,null,null,"Total (€)",{"$f":"SUMPRODUCT(AC28:AC36,AE28:AE36)","v":634.68999999999994}]
["€/m2 MO"]
[{"$f":"VLOOKUP(A14,Rendimientos!B30:E35,4,FALSE)","v":8.6999999999999993},"OTROS CONCEPTOS (mano de obra, aislante, etc.)",null,"UD","UD/m2","UD","€ / UD",1,"%","€/m2","€"]
[null," ","Mano de obra: Oficial 1ª","-","-","-","-",1,"-",{"$f":"H41*A40","v":8.6999999999999993},{"$f":"IFERROR(J41*$B$14,\"\")","v":8.6999999999999993}]
[null," "," "," "," ",{"$f":"E42*B11","v":{"$error":"#VALUE!"}}," ",1,0,null,{"$f":"IFERROR(J42*$B$14,\"\")","v":0}]
[null," "," "," "," ",{"$f":"E43*B11","v":{"$error":"#VALUE!"}}," ",1,0,null,0]
[null," ",null,null,null,null,null,null,null,null," "]
[null," "," "," "," ",null,null,null,"Total otros conceptos",{"$f":"SUM(IFERROR(J39:J43,\" \"))","v":8.6999999999999993},{"$f":"K39+SUM(K41:K43)","v":8.6999999999999993}]
[null," "," "," "," ",null," "]
[null,null,null,null,null,null,null,null,"TOTAL ",{"$f":"J38+J45","v":28.139999999999997},{"$f":"K38+K45","v":28.139999999999997}]
[null,null,null,null,null,null,"Beneficio (%)",1,"TOTAL inc. Beneficio",{"$f":"J47*(1+G49/100)","v":33.767999999999994},{"$f":"K47*(1+G49/100)","v":33.767999999999994}]
[null,null,null,null,null,null,{"$f":"H49* A21","v":20},1]
[]
[null,{"$f":"Rendimientos!C141","v":"NOTA: Rendimientos calculados teniendo en cuenta un despedicio del 2% en las placas y del 5% en el resto del sistema."}]
[]
[]
[]
[]
[]
[]
[]
[]
[]
[]
[]
[]
[]
[]
[]
[]
[]
[]
[]
[]
[]
[]
[]
[]
[]
[]
[]
[]
[]
[]
[]
[]
[]
[]
[]
[]
[]
[]
[]
[]
[]
[]
[]
[]
[]
[]
[]
[]
[]
[]
[]
[null,"LINKS A DESPLEGABLES"]
[]
[null,"Acabado"]
[]
[null,{"$f":"Rendimientos!B26","v":"Q3"},{"$f":"Rendimientos!C26","v":"Totalmente finalizado con nivel de acabado Q3"}]
[null,{"$f":"Rendimientos!B27","v":"Q4"},{"$f":"Rendimientos!C27","v":"Totalmente finalizado con nivel de acabado Q4"}]
[]
[null,"Modulación"]
[null,null,{"$f":"Rendimientos!C28","v":600}]
[null,null,{"$f":"Rendimientos!C29","v":400}]
[]
[null,"Placas"]
[null,"040113",{"$f":"VLOOKUP(B115,Listado!$A$5:$B$54,2,FALSE)","v":"PLACA ATT BASIC 13X600X1200 (78)"}]
[null,"040115",{"$f":"VLOOKUP(B116,Listado!$A$5:$B$54,2,FALSE)","v":"PLACA ATT BASIC 15X600X1200 (66)"}]
[null,"040120",{"$f":"VLOOKUP(B117,Listado!$A$5:$B$54,2,FALSE)","v":"PLACA ATT BASIC 20X600X1200 (48)"}]
[null,"040213",{"$f":"VLOOKUP(B118,Listado!$A$5:$B$54,2,FALSE)","v":"PLACA ATT HIDRO 13X600X1200 (78)"}]
[null,"040215",{"$f":"VLOOKUP(B119,Listado!$A$5:$B$54,2,FALSE)","v":"PLACA ATT HIDRO 15X600X1200 (66)"}]
[null,"040220",{"$f":"VLOOKUP(B120,Listado!$A$5:$B$54,2,FALSE)","v":"PLACA ATT HIDRO 20X600X1200 (48)"}]
[null,"040313",{"$f":"VLOOKUP(B121,Listado!$A$5:$B$54,2,FALSE)","v":"PLACA ATT FUEGO 13X600X1200 (78)"}]
[null,"040315",{"$f":"VLOOKUP(B122,Listado!$A$5:$B$54,2,FALSE)","v":"PLACA ATT FUEGO 15X600X1200 (66)"}]
[null,"040320",{"$f":"VLOOKUP(B123,Listado!$A$5:$B$54,2,FALSE)","v":"PLACA ATT FUEGO 20X600X1200 (48)"}]
[null,"040413",{"$f":"VLOOKUP(B124,Listado!$A$5:$B$54,2,FALSE)","v":"PLACA ATT RESIST 13X600X1200 (78)"}]
[null,"040415",{"$f":"VLOOKUP(B125,Listado!$A$5:$B$54,2,FALSE)","v":"PLACA ATT RESIST 15X600X1200 (66)"}]
[null,"040420",{"$f":"VLOOKUP(B126,Listado!$A$5:$B$54,2,FALSE)","v":"PLACA ATT RESIST 20X600X1200 (48)"}]
[null,"040513",{"$f":"VLOOKUP(B127,Listado!$A$5:$B$54,2,FALSE)","v":"PLACA ATT HIDROPLUS 13X600X1200 (78)"}]
[null,"040515",{"$f":"VLOOKUP(B128,Listado!$A$5:$B$54,2,FALSE)","v":"PLACA ATT HIDROPLUS 15X600X1200 (66)"}]
[null,"040520",{"$f":"VLOOKUP(B129,Listado!$A$5:$B$54,2,FALSE)","v":"PLACA ATT HIDROPLUS 20X600X1200 (48)"}]
[null,"040613",{"$f":"VLOOKUP(B130,Listado!$A$5:$B$54,2,FALSE)","v":"PLACA ATT SUPREM 13X600X1200 (78)"}]
[null,"040615",{"$f":"VLOOKUP(B131,Listado!$A$5:$B$54,2,FALSE)","v":"PLACA ATT SUPREM 15X600X1200 (66)"}]
[null,"040620",{"$f":"VLOOKUP(B132,Listado!$A$5:$B$54,2,FALSE)","v":"PLACA ATT SUPREM 20X600X1200 (48)"}]
[]
[null,"Montante"]
[null,"48104925",{"$f":"VLOOKUP(B135,Listado!$A$5:$B$54,2,FALSE)","v":"MONTANTE 49X2500 (8u x 16p)"}]
[null,"48104926",{"$f":"VLOOKUP(B136,Listado!$A$5:$B$54,2,FALSE)","v":"MONTANTE 49X2600 (8u x 16p)"}]
[null,"48104927",{"$f":"VLOOKUP(B137,Listado!$A$5:$B$54,2,FALSE)","v":"MONTANTE 49X2700 (8u x 16p)"}]
[null,"48104928",{"$f":"VLOOKUP(B138,Listado!$A$5:$B$54,2,FALSE)","v":"MONTANTE 49X2800 (8u x 16p)"}]
[null,"48104930",{"$f":"VLOOKUP(B139,Listado!$A$5:$B$54,2,FALSE)","v":"MONTANTE 49X3000 (8u x 16p)"}]
[null,"48104935",{"$f":"VLOOKUP(B140,Listado!$A$5:$B$54,2,FALSE)","v":"MONTANTE 49X3500 (8u x 16p)"}]
[null,"48107426",{"$f":"VLOOKUP(B141,Listado!$A$5:$B$54,2,FALSE)","v":"MONTANTE 74X2600 (8u x 16p)"}]
[null,"48107427",{"$f":"VLOOKUP(B142,Listado!$A$5:$B$54,2,FALSE)","v":"MONTANTE 74X2700 (8u x 16p)"}]
[null,"48107430",{"$f":"VLOOKUP(B143,Listado!$A$5:$B$54,2,FALSE)","v":"MONTANTE 74X3000 (8u x 12p)"}]
[null,"48109930",{"$f":"VLOOKUP(B144,Listado!$A$5:$B$54,2,FALSE)","v":"MONTANTE 99X3000 (8u x 16p)"}]
[]
[null,"Pasta de juntas"]
[null,"0470010110",{"$f":"VLOOKUP(B147,Listado!$A$5:$B$54,2,FALSE)","v":"PASTA ATT JUNTAS 10KG 60 MIN (56)"}]
[null,"0470010210",{"$f":"VLOOKUP(B148,Listado!$A$5:$B$54,2,FALSE)","v":"PASTA ATT JUNTAS 10KG 30 MIN (56)"}]
[null,"0470010310",{"$f":"VLOOKUP(B149,Listado!$A$5:$B$54,2,FALSE)","v":"PASTA ATT JUNTAS 10KG 300 MIN (56)"}]
[null,"0470010111",{"$f":"VLOOKUP(B150,Listado!$A$5:$B$54,2,FALSE)","v":"PASTA ATT JUNTAS H 10KG 60 MIN (56) "}]
[null,"0470010511",{"$f":"VLOOKUP(B151,Listado!$A$5:$B$54,2,FALSE)","v":"PASTA ATT JUNTAS H 10KG 300 MIN (56) "}]

{"sheet":"Tabique doble placa","index":7,"n_rows":152,"n_cols":60,"rows_kept":152,"cut":false,"hidden":false,"merged":[[6,2,6,51],[25,12,25,14],[25,15,25,16],[25,17,25,19],[25,20,25,21],[25,24,25,27],[25,28,25,29],[25,36,25,37],[25,38,25,39],[25,52,25,55],[25,56,26,56],[38,14,38,16],[38,38,39,42],[48,8,49,8],[48,9,49,9],[48,10,49,10]]}
[null,null,"                     RENDIMIENTOS"]
[null,null,"                     PEDIDO MATERIALES"]
[null,null,"                     PRESUPUESTO"]
[null,null,"                     LISTA DE MATERIALES"]
[null,null,null,{"$f":"VLOOKUP(BE37,'Índice sistemas'!C:E,3,FALSE)","v":"TABIQUE ATT® 101/600 (49)  [13+13+49+13+13]"},null,null,null,null,null,null,null,null,{"$f":"VLOOKUP(BE37,'Índice sistemas'!C:E,3,FALSE)","v":"TABIQUE ATT® 101/600 (49)  [13+13+49+13+13]"},null,null,null,null,null,null,null,{"$f":"VLOOKUP(BE37,'Índice sistemas'!C:E,3,FALSE)","v":"TABIQUE ATT® 101/600 (49)  [13+13+49+13+13]"},null,null,null,null,null,null,null,{"$f":"VLOOKUP(BE37,'Índice sistemas'!C:E,3,FALSE)","v":"TABIQUE ATT® 101/600 (49)  [13+13+49+13+13]"},null,null,null,null,null,null,null,{"$f":"AC5","v":"TABIQUE ATT® 101/600 (49)  [13+13+49+13+13]"},null,null,null,null,null,null,null,{"$f":"AK5","v":"TABIQUE ATT® 101/600 (49)  [13+13+49+13+13]"}]
[]
[null,null,{"$f":"VLOOKUP(BE37,'Índice sistemas'!C:N,(BE29+6),FALSE)","v":"Tabique formado por dos placas BASIC de 13 mm de espesor compuestas por yeso natural, fibra de vidrio y aditivos inorgánicos que le aportan alta dureza y resistencia mecánica. Reacción al fuego: EUROCLASE A1. Sistema de galces desiguales: las placas encajan entre ellas dejando una entrecalle de 3 mm por donde se inserta la pasta de juntas. Este sistema no utiliza cinta de papel. La pasta de juntas se aplica en las cavidades de las placas y una masilla elástica en los encuentros. Atornillada a cada lado de una estructura metálica de acero galvanizado formada por canales de 50 mm y montantes de 51x49x49 mm con una modulación de 600 mm entre ejes, dando un ancho total de tabique de 101 mm. Incluida parte proporcional del resto de materiales: tornillería, pasta de juntas, masilla para encuentros perimetrales, fijaciones, junta estanca, etc. Montaje según norma de instalación UNE 102043 y exigencias del CTE."}]
[{"$f":"Datos!A15","v":"clientes@elalteron.com"},null,{"$f":"IF(B10=B107,C107,IF(B10=B108,C108,C109))","v":"Totalmente finalizado con nivel de acabado Q3"}]
["CODIFICACIÓN MANO OBRA"]
[{"$f":"IF(B10=\"Q2\",2,IF(B10=\"Q3\",3,4))","v":3},"Q3","INTRODUCIR ACABADO DESEADO"]
[]
[{"$f":"B12/10","v":60},600,"INTRODUCIR MODULACIÓN "]
[]
[{"$f":"SUM(A10:A13)","v":63},1,"INTRODUCIR CANTIDAD m2"]
["PESTAÑA DATOS"]
[{"$f":"Datos!A6","v":30}]
[{"$f":"Datos!A7","v":30}]
[{"$f":"Datos!A8","v":30}]
[{"$f":"Datos!A9","v":30},null,"Material calculado para ",null,null,null,null,null,null,null,null,null,null,null,null,null,null,null,null,null,{"$f":"B14","v":1},"m2",null,null,null,null,null,null,{"$f":"B14","v":1},"m2"]
[{"$f":"Datos!A10","v":30}]
[{"$f":"Datos!A11","v":20}]
[{"$f":"Datos!A12","v":"pedidos@elalteron.com"}]
[{"$f":"Datos!A13","v":"repuesto@elalteron.com"},null,null,null,null,null,null,null,null,null,null,null,null,null,null,null,null,null,null,null,null,null,null,null,null,null,null,null,null,null,null,null,null,null,null,null,null,null,null,null,null,null,null,null,"Precio",{"$f":"AS5","v":"TABIQUE ATT® 101/600 (49)  [13+13+49+13+13]"},null,null,null,null,48.492000000000004,"€/m2"]
[{"$f":"Datos!A14","v":"compras@elalteron.com"},null,null,null,null,null,null,null,null,null,null,null,null,null,null,null,null,null,null,null,null,null,null,null,null,null,null,null,null,null,null,null,null,null,null,null,null,null,null,null,null,null,null,null,"Cantidad de sistema",null,null,null,null,null,1,"m2"]
[{"$f":"IF(B10=\"Q2\",0,'Tabique doble placa'!A18)","v":30},null,null,null,null,null,null,null,null,null,null,null,null,null,null,null,null,null,null,null,null,null,null,null,null,null,null,null,null,null,null,null,null,null,null,null,null,null,null,null,null,null,null,null,"TOTAL",null,null,null,null,null,{"$f":"AY23*AY24","v":48.492000000000004},"€"]
["MULTIPLICADOR",null,null,"UD de MEDIDA","RENDIMIENTO","CANTIDAD","CANTIDAD",null,"DESCUENTO","REPERCUSIÓN"," TOTAL",null,"TOTAL PIEZAS",null,null,"DESGLOSE",null,"REDONDEADO ",null,null,"TOTAL PIEZAS",null,"PRECIO","DESCUENTO","DESGLOSE EN PIEZAS",null,null,null,"REDONDEADO ",null,"PRECIO","DESCUENTO",null,null,null,null,"TOTAL PIEZAS",null,"DESGLOSE",null,null,null,null,null,null,null,null,null,null,null,null,null,"DATOS DE LISTADO Y RENDIMIENTOS",null,null,null,"SISTEMA"]
["TRASDOSADO","CÓDIGO","MATERIALES","UD","UD/m2","UD","€ / UD",null,"%","€/m2","€",null,"CANTIDAD","€/UD","UD","PAQ/PAL","PIEZAS","CANTIDAD","€","UD","CANTIDAD","UD","€/UD","%",null,null,null,null,"CANTIDAD","UD","€/UD","%",null,null,null,null,"CANTIDAD","UD","PAQ/PAL","PIEZAS",null,null,null,null,null,null,null,null,null,null,null,null,"ALTO","LARGO","UNI.CAJA","CAJAS/PALE",null,"Id tipo placa ","Id columnas"]
[4,{"$f":"VLOOKUP(C28,Listado!$B$4:$D$30,2,FALSE)","v":"040113"},"PLACA ATT BASIC 13X600X1200 (78)","m2",{"$f":"A28*Rendimientos!E6","v":4.08},{"$f":"$B$14*E28","v":4.08},{"$f":"VLOOKUP(B28,Listado!$A$5:$I$54,9,FALSE)","v":6.36},1,{"$f":"H28*A16","v":30},{"$f":"ROUND(E28*G28*(1-I28/100),2)","v":18.16},{"$f":"J28*$B$14","v":18.16},null,{"$f":"ROUNDUP(($B$14*E28)/(BA28*BB28),0)","v":6},{"$f":"ROUND(VLOOKUP(B28,Listado!A:I,9,FALSE)*(BA28*BB28),2)","v":4.58},"PLACAS",{"$f":"INT(M28/($BC$28*$BD$28))","v":0},{"$f":"M28-P28*$BC$28*$BD$28","v":6},{"$f":"ROUNDUP(($B$14*E28)/(BA28*BB28*BC28*BD28),0)","v":1},{"$f":"$N$28*R28*$BD$28","v":357.24},"PALETS",{"$f":"M28","v":6},"PLACAS",{"$f":"N28","v":4.58},{"$f":"I28","v":30},{"$f":"INT(U28/($BC$28*$BD$28))","v":0},"PALETS",{"$f":"U28-Y28*$BC$28*$BD$28","v":6},"PLACAS",{"$f":"R28","v":1},{"$f":"T28","v":"PALETS"},{"$f":"$N$28*$BD$28","v":357.24},{"$f":"X28","v":30},null,null,null,null,{"$f":"U28","v":6},"PLACAS",{"$f":"INT(AK28/($BC$28*$BD$28))","v":0},{"$f":"AK28-AM28*$BC$28*$BD$28","v":6},null,null,null,null,null,null,null,null,null,null,null,null,{"$f":"VLOOKUP($B28,Listado!A:I,5,FALSE)","v":0.6},{"$f":"VLOOKUP($B28,Listado!A:I,6,FALSE)","v":1.2},{"$f":"VLOOKUP($B28,Listado!A:I,7,FALSE)","v":1},{"$f":"VLOOKUP($B28,Listado!A:I,8,FALSE)","v":78},{"$f":"RIGHT(B28,2)","v":"13"},"en código alt","hoja \"Sistema\"","Tipo"]
[1,{"$f":"IF(BE30=\"49\",48115030,IF(BE30=\"74\",\"48117530\",\"481110030\"))","v":48115030},{"$f":"VLOOKUP(B29,Listado!$A$5:$B$54,2,FALSE)","v":"CANAL 50X3000 (8u x 16p)"},"ml",{"$f":"A29*Rendimientos!E7","v":0.8},{"$f":"$B$14*E29","v":0.8},{"$f":"VLOOKUP(B29,Listado!$A$5:$I$54,9,FALSE)","v":3.55},1,{"$f":"H29* A17","v":30},1.99,1.99,null,{"$f":"ROUNDUP(($B$14*E29)/(BB29),0)","v":1},{"$f":"ROUND(VLOOKUP(B29,Listado!A:I,9,FALSE)*BB29,2)","v":10.65},"PERFILES",{"$f":"INT(M29/$BC$29)","v":0},{"$f":"M29-P29*$BC$29","v":1},{"$f":"ROUNDUP(($B$14*E29)/(BB29*BC29),0)","v":1},{"$f":"R29*$BC$29*$N$29","v":85.2},"PAQUETES",{"$f":"M29","v":1},"PERFILES",10.65,{"$f":"I29","v":30},{"$f":"INT(U29/$BC$29)","v":0},"PAQUETES",{"$f":"U29-Y29*$BC$29","v":1},"PERFILES",{"$f":"R29","v":1},"PAQUETES",{"$f":"$BC$29*$N$29","v":85.2},{"$f":"X29","v":30},null,null,null,null,{"$f":"U29","v":1},"PERFILES",{"$f":"INT(AK29/$BC$29)","v":0},{"$f":"AK29-AM29*$BC$29","v":1},null,null,null,null,null,null,null,null,null,null,null,null,{"$f":"VLOOKUP($B29,Listado!A:I,5,FALSE)","v":0},{"$f":"VLOOKUP($B29,Listado!A:I,6,FALSE)","v":3},{"$f":"VLOOKUP($B29,Listado!A:I,7,FALSE)","v":8},{"$f":"VLOOKUP($B29,Listado!A:I,8,FALSE)","v":16},{"$f":"LEFT(RIGHT(B28,3),1)","v":"1"},1,7,"Basic"]
[1,{"$f":"VLOOKUP(C30,Listado!$B$5:$C$54,2,FALSE)","v":"48104930"},"MONTANTE 49X3000 (8u x 16p)","ml",{"$f":"IF(B12=600,A30*Rendimientos!E9,A30*Rendimientos!E8)","v":2.1},{"$f":"$B$14*E30","v":2.1},{"$f":"VLOOKUP(B30,Listado!$A$5:$I$54,9,FALSE)","v":4.54},1,{"$f":"H30* A17","v":30},6.67,6.67,null,{"$f":"ROUNDUP(($B$14*E30)/(BB30),0)","v":1},{"$f":"ROUND(VLOOKUP(B30,Listado!$A$5:$I$54,9,FALSE)*BB30,2)","v":13.62},"PERFILES",{"$f":"INT(M30/$BC$30)","v":0},{"$f":"M30-P30*$BC$30","v":1},{"$f":"ROUNDUP(($B$14*E30)/(BB30*BC30),0)","v":1},{"$f":"R30*$BC$30*$N$30","v":108.96},"PAQUETES",{"$f":"M30","v":1},"PERFILES",13.62,{"$f":"I30","v":30},{"$f":"INT(U30/$BC$30)","v":0},"PAQUETES",{"$f":"U30-Y30*$BC$30","v":1},"PERFILES",{"$f":"R30","v":1},"PAQUETES",{"$f":"$BC$30*$N$30","v":108.96},30,null,null,null,null,{"$f":"U30","v":1},"PERFILES",{"$f":"INT(AK30/$BC$30)","v":0},{"$f":"AK30-AM30*$BC$30","v":1},null,null,null,null,null,null,null,null,null,null,null,null,{"$f":"VLOOKUP($B30,Listado!A:I,5,FALSE)","v":0},{"$f":"VLOOKUP($B30,Listado!A:I,6,FALSE)","v":3},{"$f":"VLOOKUP($B30,Listado!A:I,7,FALSE)","v":8},{"$f":"VLOOKUP($B30,Listado!A:I,8,FALSE)","v":16},{"$f":"LEFT(RIGHT(B30,4),2)","v":"49"},2,8,"Hidro"]
[2,{"$f":"IF(BE28=\"20\",\"4802010135\",\"4802010125\")","v":"4802010125"},{"$f":"VLOOKUP(B31,Listado!$A$5:$B$54,2,FALSE)","v":"TORNILLOS ATT PP 3,5X25 (1000)"},"ud",{"$f":"IF(B12=600,A31*Rendimientos!E17,A31*Rendimientos!E11)","v":28},28,{"$f":"ROUND(VLOOKUP(B31,Listado!$A$5:$I$54,9,FALSE)/BA31,2)","v":0.03},1,{"$f":"H31* A19","v":30},0.59,0.59,null,{"$f":"ROUNDUP(($B$14*E31)/(BC31),0)","v":1},{"$f":"VLOOKUP(B31,Listado!A:I,9,FALSE)","v":29.06},"CAJAS",{"$f":"($B$14*E31)/(BC31)","v":2.8000000000000001E-2},"CAJAS",{"$f":"M31","v":1},{"$f":"R31*$N$31","v":29.06},{"$f":"O31","v":"CAJAS"},1,"CAJAS",29.06,30,null,null,{"$f":"U31","v":1},"CAJAS",1,"CAJAS",{"$f":"$N$31","v":29.06},30,null,null,null,null,1,"CAJAS",null,null,null,null,null,null,null,null,null,null,null,null,null,null,{"$f":"VLOOKUP($B31,Listado!A:I,5,FALSE)","v":1000},{"$f":"VLOOKUP($B31,Listado!A:I,6,FALSE)","v":0},{"$f":"Rendimientos!F11","v":1000},null,{"$f":"IF(BE29=\"1\",1,IF(BE29=\"2\",2,IF(BE29=\"3\",3,IF(BE29=\"4\",4,IF(BE29=\"5\",5,6)))))","v":1},3,9,"Fuego"]
[2,{"$f":"IF(BE28=\"20\",\"4802010155\",IF(BE28=\"15\",\"4802010145\",\"4802010135\"))","v":"4802010135"},{"$f":"VLOOKUP(B32,Listado!$A$5:$B$54,2,FALSE)","v":"TORNILLOS ATT PP 3,5X35 (1000)"},"ud",{"$f":"IF(B12=600,A32*Rendimientos!E18,A32*Rendimientos!E12)","v":28},28,{"$f":"ROUND(VLOOKUP(B32,Listado!$A$5:$I$54,9,FALSE)/BA32,2)","v":0.03},1,{"$f":"H32* A19","v":30},0.59,0.59,null,1,{"$f":"VLOOKUP(B32,Listado!A:I,9,FALSE)","v":33.28},"CAJAS",2.8000000000000001E-2,"CAJAS",{"$f":"M32","v":1},{"$f":"R32*$N$32","v":33.28},{"$f":"O32","v":"CAJAS"},1,"CAJAS",{"$f":"N32","v":33.28},{"$f":"I32","v":30},null,null,1,"CAJAS",1,{"$f":"T32","v":"CAJAS"},{"$f":"$N$32","v":33.28},{"$f":"X32","v":30},null,null,null,null,1,"CAJAS",null,null,null,null,null,null,null,null,null,null,null,null,null,null,{"$f":"VLOOKUP($B32,Listado!A:I,5,FALSE)","v":1000},{"$f":"VLOOKUP($B32,Listado!A:I,6,FALSE)","v":0},{"$f":"Rendimientos!F12","v":1000}]
[1,{"$f":"Rendimientos!A22","v":"480903T03"},{"$f":"VLOOKUP(B33,Listado!$A$5:$B$54,2,FALSE)","v":"TACO RAPIDO ALTERON 5X30 (100u)"},"ud",{"$f":"A33*Rendimientos!E22","v":2},2,{"$f":"ROUND(VLOOKUP(B33,Listado!$A$5:$I$54,9,FALSE)/Rendimientos!F22,2)","v":0.11},1,{"$f":"H33* A19","v":30},0.15,0.15,null,1,{"$f":"VLOOKUP(B33,Listado!A:I,9,FALSE)","v":10.53},"CAJAS",0.02,"CAJAS",1,{"$f":"R33*$N$33","v":10.53},{"$f":"O33","v":"CAJAS"},1,"CAJAS",10.53,30,null,null,1,"CAJAS",1,"CAJAS",{"$f":"$N$33","v":10.53},30,null,null,null,null,1,"CAJAS",null,null,null,null,null,null,null,null,null,null,null,null,null,null,{"$f":"VLOOKUP($B33,Listado!A:I,5,FALSE)","v":0},{"$f":"VLOOKUP($B33,Listado!A:I,6,FALSE)","v":0},{"$f":"Rendimientos!F22","v":100},null,{"$f":"B12","v":600},4,10,"Resist"]
[4,{"$f":"VLOOKUP(C34,Listado!$B$5:$C$54,2,FALSE)","v":"0470010110"},"PASTA ATT JUNTAS 10KG 60 MIN (56)","kg",{"$f":"A34*Rendimientos!E25","v":0.44},0.44,{"$f":"ROUND(VLOOKUP(B34,Listado!$A$5:$I$54,9,FALSE)/Rendimientos!F25,2)","v":1.99},1,{"$f":"H34* A18","v":30},0.61,0.61,null,1,{"$f":"VLOOKUP(B34,Listado!A:I,9,FALSE)","v":19.850000000000001},"SACOS",4.3999999999999997E-2,"SACOS",1,{"$f":"R34*$N$34","v":19.850000000000001},"SACOS",1,"SACOS",19.850000000000001,30,null,null,1,"SACOS",1,"SACOS",{"$f":"$N$34","v":19.850000000000001},30,null,null,null,null,1,"SACOS",null,null,null,null,null,null,null,null,null,null,null,null,null,null,{"$f":"VLOOKUP($B34,Listado!A:I,5,FALSE)","v":0},{"$f":"VLOOKUP($B34,Listado!A:I,6,FALSE)","v":0},{"$f":"Rendimientos!F25","v":10}]
[4,"48040101",{"$f":"VLOOKUP(B35,Listado!$A$5:$B$54,2,FALSE)","v":"MASILLA PARA ENCUENTROS ATT"},"mil",{"$f":"A35*Rendimientos!$E$23","v":40},{"$f":"$B$14*E35","v":40},{"$f":"VLOOKUP(B35,Listado!$A$5:$I$54,9,FALSE)","v":2.4199999999999999E-2},1,{"$f":"H35* A19","v":30},0.68,0.68,null,1,{"$f":"VLOOKUP(B35,Listado!A:J,10,FALSE)","v":7.26},"BOTES",0.13333333333333333,{"$f":"O35","v":"BOTES"},1,{"$f":"R35*$N$35","v":7.26},{"$f":"O35","v":"BOTES"},1,{"$f":"T35","v":"BOTES"},7.26,30,null,null,1,{"$f":"V35","v":"BOTES"},1,"BOTES",{"$f":"$N$35","v":7.26},30,null,null,null,null,1,{"$f":"AD35","v":"BOTES"},null,null,null,null,null,null,null,null,null,null,null,null,null,null,{"$f":"VLOOKUP($B35,Listado!A:I,5,FALSE)","v":0},{"$f":"VLOOKUP($B35,Listado!A:I,6,FALSE)","v":0},{"$f":"Rendimientos!F23","v":300}]
[1,{"$f":"IF(BE30=\"49\",\"48010348\",IF(BE30=\"74\",\"48010370\",\"48010390\"))","v":"48010348"},{"$f":"VLOOKUP(B36,Listado!$A$5:$B$54,2,FALSE)","v":"JUNTA ESTANCA ATT 50MM (30ML)"},"ml",{"$f":"A36*Rendimientos!E24","v":0.8},0.8,{"$f":"ROUND(VLOOKUP(B36,Listado!$A$5:$I$54,9,FALSE)/Rendimientos!F24,2)","v":0.55000000000000004},1,{"$f":"H36* A20","v":30},0.31,0.31,null,1,{"$f":"VLOOKUP(B36,Listado!A:I,9,FALSE)","v":16.59},"ROLLOS",2.6666666666666668E-2,"ROLLOS",1,{"$f":"R36*$N$36","v":16.59},{"$f":"O36","v":"ROLLOS"},1,"ROLLOS",16.59,30,null,null,1,"ROLLOS",1,"ROLLOS",{"$f":"$N$36","v":16.59},30,null,null,null,null,1,"ROLLOS",null,null,null,null,null,null,null,null,null,null,null,null,null,null,{"$f":"VLOOKUP($B36,Listado!A:I,5,FALSE)","v":0},{"$f":"VLOOKUP($B36,Listado!A:I,6,FALSE)","v":0},{"$f":"Rendimientos!F24","v":30}]
[2,{"$f":"IF(B10=\"Q3\",\"\",Rendimientos!A27)","v":""},{"$f":"IFERROR(VLOOKUP(B37,Listado!A5:B54,2,FALSE),\"\")","v":""},{"$f":"IF(B10=\"Q3\",\"\",\"kg\")","v":""},{"$f":"IF(B10=\"Q3\",\"\",A37*Rendimientos!E27)","v":""},{"$f":"IF(B10=\"Q3\",\"\",$B$14*E37)","v":""},{"$f":"IFERROR(ROUND(VLOOKUP(B37,Listado!$A$5:$I$54,9,FALSE)/Rendimientos!F26,2),\"\")","v":""},1,{"$f":"H37* A18","v":30},{"$f":"IFERROR(ROUND(E37*G37*(1-I37/100),2),0)","v":0},{"$f":"IFERROR(J37*$B$14,0)","v":0},null,{"$f":"IFERROR(ROUNDUP(($B$14*E37)/(BC37),0),\"0\")","v":"0"},{"$f":"IFERROR(VLOOKUP(B37,Listado!A:I,9,FALSE),\"0\")","v":"0"},{"$f":"IF(B10=\"Q2\",\"\",\"SACOS\")","v":"SACOS"},{"$f":"IFERROR(($B$14*E37)/(BC37),\"\")","v":""},{"$f":"IF(B10=\"Q2\",\"\",\"SACOS\")","v":"SACOS"},"0",{"$f":"IFERROR(R37*$N$37,\"\")","v":0},{"$f":"IF(B10=\"Q2\",\"\",\"SACOS\")","v":"SACOS"},"0",{"$f":"IF(B10=\"Q2\",\" \",\"SACOS\")","v":"SACOS"},"0",{"$f":"I37","v":30},null,null,{"$f":"IF(U37=\"\",\"\",U37)","v":"0"},{"$f":"IF(B10=\"Q2\",\" \",\"SACOS\")","v":"SACOS"},"0","SACOS",{"$f":"IFERROR($N$37,\"\")","v":"0"},30,null,null,null,null,"0",{"$f":"IF(B10=\"Q2\",\" \",\"SACOS\")","v":"SACOS"},null,null,null,null,null,null,null,null,null,null,null,null,null,null,{"$f":"VLOOKUP($B37,Listado!A:I,5,FALSE)","v":{"$error":"#N/A"}},{"$f":"VLOOKUP($B37,Listado!A:I,6,FALSE)","v":{"$error":"#N/A"}},{"$f":"Rendimientos!F27","v":10},null,{"$f":"BE33*100+BE30*100+BE28*4","v":64952}]
[]
[null,null,null,null,null,null,null,null,"Total material",{"$f":"SUM(J28:J37)","v":29.749999999999996},{"$f":"SUM(K28:K37)","v":29.749999999999996},null,"Total (€)",{"$f":"SUMPRODUCT(M28:M37,N28:N37)","v":168.32},null,null,null,"Total (€)",{"$f":"SUM(S28:S37)","v":667.96999999999991},null,"Total (€)",{"$f":"SUMPRODUCT(U28:U37,W28:W37)","v":168.32},null,null,null,null,null,null,"Total (€)",{"$f":"SUMPRODUCT(AC28:AC37,AE28:AE37)","v":667.96999999999991}]
["€/m2 MO"]
[{"$f":"VLOOKUP(A14,Rendimientos!B36:E41,4,FALSE)","v":12.299999999999999},"OTROS CONCEPTOS (mano de obra, aislante, etc.)",null,"UD","UD/m2","UD","€ / UD",null,"%","€/m2","€"]
[null," ","Mano de obra: Oficial 1ª","-","-","-","-",1,"-",{"$f":"H42*A41","v":12.299999999999999},{"$f":"IFERROR(J42*$B$14,\"\")","v":12.299999999999999}]
[null," "," "," "," ",{"$f":"E43*B12","v":{"$error":"#VALUE!"}}," ",1,0,null,{"$f":"IFERROR(J43*$B$14,\"\")","v":0}]
[null," "," "," "," ",{"$f":"E44*B12","v":{"$error":"#VALUE!"}}," ",1,0,null,0]
[null," ",null," "," ",null," ",null,null," "," "]
[null,null,null,null,null,null,null,null,"Total otros conceptos",{"$f":"SUM(IFERROR(J40:J44,\" \"))","v":12.299999999999999},{"$f":"K40+SUM(K42:K44)","v":12.299999999999999}]
[]
[null,null,null,null,null,null,null,null,"TOTAL ",{"$f":"J39+J46","v":42.05},{"$f":"K39+K46","v":42.05}]
[null,null,null,null,null,null,"Beneficio (%)",1,"TOTAL inc. Beneficio",{"$f":"J48*(1+G50/100)","v":50.459999999999994},{"$f":"K48*(1+G50/100)","v":50.459999999999994}]
[null,null,null,null,null,null,{"$f":"H50* A21","v":20},1]
[]
[null,{"$f":"Rendimientos!C141","v":"NOTA: Rendimientos calculados teniendo en cuenta un despedicio del 2% en las placas y del 5% en el resto del sistema."}]
[]
[]
[]
[]
[]
[]
[]
[]
[]
[]
[]
[]
[]
[]
[]
[]
[]
[]
[]
[]
[]
[]
[]
[]
[]
[]
[]
[]
[]
[]
[]
[]
[]
[]
[]
[]
[]
[]
[]
[]
[]
[]
[]
[]
[]
[]
[]
[]
[]
[]
[]
[null,"LINKS A DESPLEGABLES"]
[]
[null,"Acabado"]
[null,{"$f":"Rendimientos!B25","v":"Q2"},{"$f":"Rendimientos!C25","v":"Totalmente finalizado con nivel de acabado Q2"}]
[null,{"$f":"Rendimientos!B26","v":"Q3"},{"$f":"Rendimientos!C26","v":"Totalmente finalizado con nivel de acabado Q3"}]
[null,{"$f":"Rendimientos!B27","v":"Q4"},{"$f":"Rendimientos!C27","v":"Totalmente finalizado con nivel de acabado Q4"}]
[]
[null,"Modulación"]
[null,null,{"$f":"Rendimientos!C28","v":600}]
[null,null,{"$f":"Rendimientos!C29","v":400}]
[]
[null,"Placas"]
[null,"040113",{"$f":"VLOOKUP(B116,Listado!$A$5:$B$54,2,FALSE)","v":"PLACA ATT BASIC 13X600X1200 (78)"}]
[null,"040115",{"$f":"VLOOKUP(B117,Listado!$A$5:$B$54,2,FALSE)","v":"PLACA ATT BASIC 15X600X1200 (66)"}]
[null,"040120",{"$f":"VLOOKUP(B118,Listado!$A$5:$B$54,2,FALSE)","v":"PLACA ATT BASIC 20X600X1200 (48)"}]
[null,"040213",{"$f":"VLOOKUP(B119,Listado!$A$5:$B$54,2,FALSE)","v":"PLACA ATT HIDRO 13X600X1200 (78)"}]
[null,"040215",{"$f":"VLOOKUP(B120,Listado!$A$5:$B$54,2,FALSE)","v":"PLACA ATT HIDRO 15X600X1200 (66)"}]
[null,"040220",{"$f":"VLOOKUP(B121,Listado!$A$5:$B$54,2,FALSE)","v":"PLACA ATT HIDRO 20X600X1200 (48)"}]
[null,"040313",{"$f":"VLOOKUP(B122,Listado!$A$5:$B$54,2,FALSE)","v":"PLACA ATT FUEGO 13X600X1200 (78)"}]
[null,"040315",{"$f":"VLOOKUP(B123,Listado!$A$5:$B$54,2,FALSE)","v":"PLACA ATT FUEGO 15X600X1200 (66)"}]
[null,"040320",{"$f":"VLOOKUP(B124,Listado!$A$5:$B$54,2,FALSE)","v":"PLACA ATT FUEGO 20X600X1200 (48)"}]
[null,"040413",{"$f":"VLOOKUP(B125,Listado!$A$5:$B$54,2,FALSE)","v":"PLACA ATT RESIST 13X600X1200 (78)"}]
[null,"040415",{"$f":"VLOOKUP(B126,Listado!$A$5:$B$54,2,FALSE)","v":"PLACA ATT RESIST 15X600X1200 (66)"}]
[null,"040420",{"$f":"VLOOKUP(B127,Listado!$A$5:$B$54,2,FALSE)","v":"PLACA ATT RESIST 20X600X1200 (48)"}]
[null,"040513",{"$f":"VLOOKUP(B128,Listado!$A$5:$B$54,2,FALSE)","v":"PLACA ATT HIDROPLUS 13X600X1200 (78)"}]
[null,"040515",{"$f":"VLOOKUP(B129,Listado!$A$5:$B$54,2,FALSE)","v":"PLACA ATT HIDROPLUS 15X600X1200 (66)"}]
[null,"040520",{"$f":"VLOOKUP(B130,Listado!$A$5:$B$54,2,FALSE)","v":"PLACA ATT HIDROPLUS 20X600X1200 (48)"}]
[null,"040613",{"$f":"VLOOKUP(B131,Listado!$A$5:$B$54,2,FALSE)","v":"PLACA ATT SUPREM 13X600X1200 (78)"}]
[null,"040615",{"$f":"VLOOKUP(B132,Listado!$A$5:$B$54,2,FALSE)","v":"PLACA ATT SUPREM 15X600X1200 (66)"}]
[null,"040620",{"$f":"VLOOKUP(B133,Listado!$A$5:$B$54,2,FALSE)","v":"PLACA ATT SUPREM 20X600X1200 (48)"}]
[]
[null,"Montante"]
[null,"48104925",{"$f":"VLOOKUP(B136,Listado!$A$5:$B$54,2,FALSE)","v":"MONTANTE 49X2500 (8u x 16p)"}]
[null,"48104926",{"$f":"VLOOKUP(B137,Listado!$A$5:$B$54,2,FALSE)","v":"MONTANTE 49X2600 (8u x 16p)"}]
[null,"48104927",{"$f":"VLOOKUP(B138,Listado!$A$5:$B$54,2,FALSE)","v":"MONTANTE 49X2700 (8u x 16p)"}]
[null,"48104928",{"$f":"VLOOKUP(B139,Listado!$A$5:$B$54,2,FALSE)","v":"MONTANTE 49X2800 (8u x 16p)"}]
[null,"48104930",{"$f":"VLOOKUP(B140,Listado!$A$5:$B$54,2,FALSE)","v":"MONTANTE 49X3000 (8u x 16p)"}]
[null,"48104935",{"$f":"VLOOKUP(B141,Listado!$A$5:$B$54,2,FALSE)","v":"MONTANTE 49X3500 (8u x 16p)"}]
[null,"48107426",{"$f":"VLOOKUP(B142,Listado!$A$5:$B$54,2,FALSE)","v":"MONTANTE 74X2600 (8u x 16p)"}]
[null,"48107427",{"$f":"VLOOKUP(B143,Listado!$A$5:$B$54,2,FALSE)","v":"MONTANTE 74X2700 (8u x 16p)"}]
[null,"48107430",{"$f":"VLOOKUP(B144,Listado!$A$5:$B$54,2,FALSE)","v":"MONTANTE 74X3000 (8u x 12p)"}]
[null,"48109930",{"$f":"VLOOKUP(B145,Listado!$A$5:$B$54,2,FALSE)","v":"MONTANTE 99X3000 (8u x 16p)"}]
[]
[null,"Pasta de juntas"]
[null,"0470010110",{"$f":"VLOOKUP(B148,Listado!$A$5:$B$54,2,FALSE)","v":"PASTA ATT JUNTAS 10KG 60 MIN (56)"}]
[null,"0470010210",{"$f":"VLOOKUP(B149,Listado!$A$5:$B$54,2,FALSE)","v":"PASTA ATT JUNTAS 10KG 30 MIN (56)"}]
[null,"0470010310",{"$f":"VLOOKUP(B150,Listado!$A$5:$B$54,2,FALSE)","v":"PASTA ATT JUNTAS 10KG 300 MIN (56)"}]
[null,"0470010111",{"$f":"VLOOKUP(B151,Listado!$A$5:$B$54,2,FALSE)","v":"PASTA ATT JUNTAS H 10KG 60 MIN (56) "}]
[null,"0470010511",{"$f":"VLOOKUP(B152,Listado!$A$5:$B$54,2,FALSE)","v":"PASTA ATT JUNTAS H 10KG 300 MIN (56) "}]

{"sheet":"Tabique triple placa","index":8,"n_rows":153,"n_cols":60,"rows_kept":153,"cut":false,"hidden":false,"merged":[[25,52,25,55],[25,56,26,56],[39,14,39,16],[39,38,40,42],[49,8,50,8],[49,9,50,9],[49,10,50,10],[0,1,4,1],[6,2,6,51],[25,12,25,14],[25,15,25,16],[25,17,25,19],[25,20,25,21],[25,24,25,27],[25,28,25,29],[25,36,25,37],[25,38,25,39]]}
[null,null,"                     RENDIMIENTOS"]
[null,null,"                     PEDIDO MATERIALES"]
[null,null,"                     PRESUPUESTO"]
[null,null,"                     LISTA DE MATERIALES"]
[null,null,null,{"$f":"VLOOKUP(BE38,'Índice sistemas'!C:E,3,FALSE)","v":"TABIQUE ATT® 127/600 (49)  [13+13+13+49+13+13+13]"},null,null,null,null,null,null,null,null,{"$f":"VLOOKUP(BE38,'Índice sistemas'!C:E,3,FALSE)","v":"TABIQUE ATT® 127/600 (49)  [13+13+13+49+13+13+13]"},null,null,null,null,null,null,null,{"$f":"VLOOKUP(BE38,'Índice sistemas'!C:E,3,FALSE)","v":"TABIQUE ATT® 127/600 (49)  [13+13+13+49+13+13+13]"},null,null,null,null,null,null,null,{"$f":"VLOOKUP(BE38,'Índice sistemas'!C:E,3,FALSE)","v":"TABIQUE ATT® 127/600 (49)  [13+13+13+49+13+13+13]"},null,null,null,null,null,null,null,{"$f":"AC5","v":"TABIQUE ATT® 127/600 (49)  [13+13+13+49+13+13+13]"},null,null,null,null,null,null,null,{"$f":"AK5","v":"TABIQUE ATT® 127/600 (49)  [13+13+13+49+13+13+13]"}]
[]
[null,null,{"$f":"VLOOKUP(BE38,'Índice sistemas'!C:N,(BE29+6),FALSE)","v":"Tabique formado por tres placas BASIC de 13 mm de espesor compuestas por yeso natural, fibra de vidrio y aditivos inorgánicos que le aportan alta dureza y resistencia mecánica. Reacción al fuego: EUROCLASE A1. Sistema de galces desiguales: las placas encajan entre ellas dejando una entrecalle de 3 mm por donde se inserta la pasta de juntas. Este sistema no utiliza cinta de papel. La pasta de juntas se aplica en las cavidades de las placas y una masilla elástica en los encuentros. Atornillada a cada lado de una estructura metálica de acero galvanizado formada por canales de 50 mm y montantes de 51x49x49 mm con una modulación de 600 mm entre ejes, dando un ancho total de tabique de 127 mm. Incluida parte proporcional del resto de materiales: tornillería, pasta de juntas, masilla para encuentros perimetrales, fijaciones, junta estanca, etc. Montaje según norma de instalación UNE 102043 y exigencias del CTE."}]
[{"$f":"Datos!A15","v":"clientes@elalteron.com"},null,{"$f":"IF(B10=B108,C108,IF(B10=B109,C109,C110))","v":"Totalmente finalizado con nivel de acabado Q3"}]
["CODIFICACIÓN MANO OBRA"]
[{"$f":"IF(B10=\"Q2\",2,IF(B10=\"Q3\",3,4))","v":3},"Q3","INTRODUCIR ACABADO DESEADO"]
[]
[{"$f":"B12/10","v":60},600,"INTRODUCIR MODULACIÓN "]
[]
[{"$f":"SUM(A10:A13)","v":63},1,"INTRODUCIR CANTIDAD m2"]
["PESTAÑA DATOS"]
[{"$f":"Datos!A6","v":30}]
[{"$f":"Datos!A7","v":30}]
[{"$f":"Datos!A8","v":30}]
[{"$f":"Datos!A9","v":30},null,"Material calculado para ",null,null,null,null,null,null,null,null,null,null,null,null,null,null,null,null,null,{"$f":"B14","v":1},"m2",null,null,null,null,null,null,{"$f":"B14","v":1},"m2"]
[{"$f":"Datos!A10","v":30}]
[{"$f":"Datos!A11","v":20}]
[{"$f":"Datos!A12","v":"pedidos@elalteron.com"}]
[{"$f":"Datos!A13","v":"repuesto@elalteron.com"},null,null,null,null,null,null,null,null,null,null,null,null,null,null,null,null,null,null,null,null,null,null,null,null,null,null,null,null,null,null,null,null,null,null,null,null,null,null,null,null,null,null,null,"Precio",{"$f":"AS5","v":"TABIQUE ATT® 127/600 (49)  [13+13+13+49+13+13+13]"},null,null,null,null,64.812000000000012,"€/m2"]
[{"$f":"Datos!A14","v":"compras@elalteron.com"},null,null,null,null,null,null,null,null,null,null,null,null,null,null,null,null,null,null,null,null,null,null,null,null,null,null,null,null,null,null,null,null,null,null,null,null,null,null,null,null,null,null,null,"Cantidad de sistema",null,null,null,null,null,1,"m2"]
[{"$f":"IF(B10=\"Q2\",0,'Tabique triple placa'!A18)","v":30},null,null,null,null,null,null,null,null,null,null,null,null,null,null,null,null,null,null,null,null,null,null,null,null,null,null,null,null,null,null,null,null,null,null,null,null,null,null,null,null,null,null,null,"TOTAL",null,null,null,null,null,{"$f":"AY23*AY24","v":64.812000000000012},"€"]
["MULTIPLICADOR",null,null,"UD de MEDIDA","RENDIMIENTO","CANTIDAD","CANTIDAD",null,"DESCUENTO","REPERCUSIÓN"," TOTAL",null,"TOTAL PIEZAS",null,null,"DESGLOSE",null,"REDONDEADO ",null,null,"TOTAL PIEZAS",null,"PRECIO","DESCUENTO","DESGLOSE EN PIEZAS",null,null,null,"REDONDEADO ",null,"PRECIO","DESCUENTO",null,null,null,null,"TOTAL PIEZAS",null,"DESGLOSE",null,null,null,null,null,null,null,null,null,null,null,null,null,"DATOS DE LISTADO Y RENDIMIENTOS",null,null,null,"SISTEMA"]
["TRASDOSADO","CÓDIGO","MATERIALES","UD","UD/m2","UD","€ / UD",null,"%","€/m2","€",null,"CANTIDAD","€/UD","UD","PAQ/PAL","PIEZAS","CANTIDAD","€","UD","CANTIDAD","UD","€/UD","%",null,null,null,null,"CANTIDAD","UD","€/UD","%",null,null,null,null,"CANTIDAD","UD","PAQ/PAL","PIEZAS",null,null,null,null,null,null,null,null,null,null,null,null,"ALTO","LARGO","UNI.CAJA","CAJAS/PALE",null,"Id tipo placa ","Id columnas"]
[6,{"$f":"VLOOKUP(C28,Listado!$B$4:$D$30,2,FALSE)","v":"040113"},"PLACA ATT BASIC 13X600X1200 (78)","m2",{"$f":"A28*Rendimientos!E6","v":6.12},{"$f":"$B$14*E28","v":6.12},{"$f":"VLOOKUP(B28,Listado!$A$5:$I$54,9,FALSE)","v":6.36},1,{"$f":"H28*A16","v":30},{"$f":"ROUND(E28*G28*(1-I28/100),2)","v":27.25},{"$f":"J28*$B$14","v":27.25},null,{"$f":"ROUNDUP(($B$14*E28)/(BA28*BB28),0)","v":9},{"$f":"ROUND(VLOOKUP(B28,Listado!A:I,9,FALSE)*(BA28*BB28),2)","v":4.58},"PLACAS",{"$f":"INT(M28/($BC$28*$BD$28))","v":0},{"$f":"M28-P28*$BC$28*$BD$28","v":9},{"$f":"ROUNDUP(($B$14*E28)/(BA28*BB28*BC28*BD28),0)","v":1},{"$f":"$N$28*R28*$BD$28","v":357.24},"PALETS",{"$f":"M28","v":9},"PLACAS",{"$f":"N28","v":4.58},{"$f":"I28","v":30},{"$f":"INT(U28/($BC$28*$BD$28))","v":0},"PALETS",{"$f":"U28-Y28*$BC$28*$BD$28","v":9},"PLACAS",{"$f":"R28","v":1},{"$f":"T28","v":"PALETS"},{"$f":"$N$28*$BD$28","v":357.24},{"$f":"X28","v":30},null,null,null,null,{"$f":"U28","v":9},"PLACAS",{"$f":"INT(AK28/($BC$28*$BD$28))","v":0},{"$f":"AK28-AM28*$BC$28*$BD$28","v":9},null,null,null,null,null,null,null,null,null,null,null,null,{"$f":"VLOOKUP($B28,Listado!$A$5:$I$54,5,FALSE)","v":0.6},{"$f":"VLOOKUP($B28,Listado!$A$5:$I$54,6,FALSE)","v":1.2},{"$f":"VLOOKUP($B28,Listado!$A$5:$I$54,7,FALSE)","v":1},{"$f":"VLOOKUP($B28,Listado!$A$5:$I$54,8,FALSE)","v":78},{"$f":"RIGHT(B28,2)","v":"13"},"en código alt","hoja \"Sistema\"","Tipo"]
[1,{"$f":"IF(BE30=\"49\",48115030,IF(BE30=\"74\",\"48117530\",\"481110030\"))","v":48115030},{"$f":"VLOOKUP(B29,Listado!$A$5:$B$54,2,FALSE)","v":"CANAL 50X3000 (8u x 16p)"},"ml",{"$f":"A29*Rendimientos!E7","v":0.8},{"$f":"$B$14*E29","v":0.8},{"$f":"VLOOKUP(B29,Listado!$A$5:$I$54,9,FALSE)","v":3.55},1,{"$f":"H29* A17","v":30},{"$f":"ROUND(E29*G29*(1-I29/100),2)","v":1.99},1.99,null,{"$f":"ROUNDUP(($B$14*E29)/(BB29),0)","v":1},{"$f":"ROUND(VLOOKUP(B29,Listado!A:I,9,FALSE)*BB29,2)","v":10.65},"PERFILES",{"$f":"INT(M29/$BC$29)","v":0},{"$f":"M29-P29*$BC$29","v":1},{"$f":"ROUNDUP(($B$14*E29)/(BB29*BC29),0)","v":1},{"$f":"R29*$BC$29*$N$29","v":85.2},"PAQUETES",{"$f":"M29","v":1},"PERFILES",10.65,{"$f":"I29","v":30},{"$f":"INT(U29/$BC$29)","v":0},"PAQUETES",{"$f":"U29-Y29*$BC$29","v":1},"PERFILES",{"$f":"R29","v":1},"PAQUETES",{"$f":"$BC$29*$N$29","v":85.2},{"$f":"X29","v":30},null,null,null,null,{"$f":"U29","v":1},"PERFILES",{"$f":"INT(AK29/$BC$29)","v":0},{"$f":"AK29-AM29*$BC$29","v":1},null,null,null,null,null,null,null,null,null,null,null,null,{"$f":"VLOOKUP($B29,Listado!$A$5:$I$54,5,FALSE)","v":0},{"$f":"VLOOKUP($B29,Listado!$A$5:$I$54,6,FALSE)","v":3},{"$f":"VLOOKUP($B29,Listado!$A$5:$I$54,7,FALSE)","v":8},{"$f":"VLOOKUP($B29,Listado!$A$5:$I$54,8,FALSE)","v":16},{"$f":"LEFT(RIGHT(B28,3),1)","v":"1"},1,7,"Basic"]
[1,{"$f":"VLOOKUP(C30,Listado!$B$5:$C$54,2,FALSE)","v":"48104930"},"MONTANTE 49X3000 (8u x 16p)","ml",{"$f":"IF(B12=600,A30*Rendimientos!E9,A30*Rendimientos!E8)","v":2.1},{"$f":"$B$14*E30","v":2.1},{"$f":"VLOOKUP(B30,Listado!$A$5:$I$54,9,FALSE)","v":4.54},1,{"$f":"H30* A17","v":30},{"$f":"ROUND(E30*G30*(1-I30/100),2)","v":6.67},6.67,null,{"$f":"ROUNDUP(($B$14*E30)/(BB30),0)","v":1},{"$f":"ROUND(VLOOKUP(B30,Listado!A:I,9,FALSE)*BB30,2)","v":13.62},"PERFILES",{"$f":"INT(M30/$BC$30)","v":0},{"$f":"M30-P30*$BC$30","v":1},{"$f":"ROUNDUP(($B$14*E30)/(BB30*BC30),0)","v":1},{"$f":"R30*$BC$30*$N$30","v":108.96},"PAQUETES",{"$f":"M30","v":1},"PERFILES",13.62,{"$f":"I30","v":30},{"$f":"INT(U30/$BC$30)","v":0},"PAQUETES",{"$f":"U30-Y30*$BC$30","v":1},"PERFILES",{"$f":"R30","v":1},"PAQUETES",{"$f":"$BC$30*$N$30","v":108.96},30,null,null,null,null,{"$f":"U30","v":1},"PERFILES",{"$f":"INT(AK30/$BC$30)","v":0},{"$f":"AK30-AM30*$BC$30","v":1},null,null,null,null,null,null,null,null,null,null,null,null,{"$f":"VLOOKUP($B30,Listado!$A$5:$I$54,5,FALSE)","v":0},{"$f":"VLOOKUP($B30,Listado!$A$5:$I$54,6,FALSE)","v":3},{"$f":"VLOOKUP($B30,Listado!$A$5:$I$54,7,FALSE)","v":8},{"$f":"VLOOKUP($B30,Listado!$A$5:$I$54,8,FALSE)","v":16},{"$f":"LEFT(RIGHT(B30,4),2)","v":"49"},2,8,"Hidro"]
[2,{"$f":"IF(BE28=\"20\",\"4802010135\",\"4802010125\")","v":"4802010125"},{"$f":"VLOOKUP(B31,Listado!$A$5:$B$54,2,FALSE)","v":"TORNILLOS ATT PP 3,5X25 (1000)"},"ud",{"$f":"IF(B12=600,A31*Rendimientos!E19,A31*Rendimientos!E13)","v":28},28,{"$f":"ROUND(VLOOKUP(B31,Listado!$A$5:$I$54,9,FALSE)/BA31,2)","v":0.03},1,{"$f":"H31* A19","v":30},0.59,0.59,null,{"$f":"ROUNDUP(($B$14*E31)/(BC31),0)","v":1},{"$f":"VLOOKUP(B31,Listado!A:I,9,FALSE)","v":29.06},"CAJAS",{"$f":"($B$14*E31)/(BC31)","v":2.8000000000000001E-2},"CAJAS",{"$f":"M31","v":1},{"$f":"R31*$N$31","v":29.06},{"$f":"O31","v":"CAJAS"},{"$f":"M31","v":1},"CAJAS",29.06,30,null,null,{"$f":"U31","v":1},"CAJAS",1,"CAJAS",{"$f":"$N$31","v":29.06},30,null,null,null,null,1,"CAJAS",null,null,null,null,null,null,null,null,null,null,null,null,null,null,{"$f":"VLOOKUP($B31,Listado!$A$5:$I$54,5,FALSE)","v":1000},{"$f":"VLOOKUP($B31,Listado!$A$5:$I$54,6,FALSE)","v":0},{"$f":"Rendimientos!F11","v":1000},null,{"$f":"IF(BE29=\"1\",1,IF(BE29=\"2\",2,IF(BE29=\"3\",3,IF(BE29=\"4\",4,IF(BE29=\"5\",5,6)))))","v":1},3,9,"Fuego"]
[2,{"$f":"IF(BE28=\"20\",\"4802010155\",IF(BE28=\"15\",\"4802010145\",\"4802010135\"))","v":"4802010135"},{"$f":"VLOOKUP(B32,Listado!$A$5:$B$54,2,FALSE)","v":"TORNILLOS ATT PP 3,5X35 (1000)"},"ud",{"$f":"IF(B12=600,A32*Rendimientos!E20,A32*Rendimientos!E14)","v":28},{"$f":"$B$14*E32","v":28},{"$f":"ROUND(VLOOKUP(B32,Listado!$A$5:$I$54,9,FALSE)/BA32,2)","v":0.03},1,{"$f":"H32* A19","v":30},{"$f":"ROUND(E32*G32*(1-I32/100),2)","v":0.59},{"$f":"J32*$B$14","v":0.59},null,{"$f":"ROUNDUP(($B$14*E32)/(BC32),0)","v":1},{"$f":"VLOOKUP(B32,Listado!A:I,9,FALSE)","v":33.28},"CAJAS",{"$f":"($B$14*E32)/(BC32)","v":2.8000000000000001E-2},"CAJAS",{"$f":"M32","v":1},{"$f":"R32*$N$32","v":33.28},{"$f":"O32","v":"CAJAS"},{"$f":"M32","v":1},"CAJAS",{"$f":"N32","v":33.28},{"$f":"I32","v":30},null,null,{"$f":"U32","v":1},"CAJAS",1,{"$f":"T32","v":"CAJAS"},{"$f":"$N$32","v":33.28},{"$f":"X32","v":30},null,null,null,null,1,"CAJAS",null,null,null,null,null,null,null,null,null,null,null,null,null,null,{"$f":"VLOOKUP($B32,Listado!$A$5:$I$54,5,FALSE)","v":1000},{"$f":"VLOOKUP($B32,Listado!$A$5:$I$54,6,FALSE)","v":0},{"$f":"Rendimientos!F12","v":1000}]
[2,{"$f":"IF(BE28=\"20\",\"4802010170\",\"4802010155\")","v":"4802010155"},{"$f":"VLOOKUP(B33,Listado!$A$5:$B$54,2,FALSE)","v":"TORNILLOS ATT PP 3,5X55 (500)"},"ud",{"$f":"IF(B12=600,A33*Rendimientos!E21,A33*Rendimientos!E15)","v":28},28,{"$f":"ROUND(VLOOKUP(B33,Listado!$A$5:$I$54,9,FALSE)/BA33,2)","v":0.1},1,{"$f":"H33* A19","v":30},1.96,1.96,null,1,{"$f":"VLOOKUP(B33,Listado!A:I,9,FALSE)","v":47.74},"CAJAS",5.6000000000000001E-2,"CAJAS",1,{"$f":"R33*$N$33","v":47.74},"CAJAS",1,"CAJAS",47.74,30,null,null,1,"CAJAS",1,"CAJAS",{"$f":"$N$33","v":47.74},30,null,null,null,null,1,"CAJAS",null,null,null,null,null,null,null,null,null,null,null,null,null,null,{"$f":"VLOOKUP($B33,Listado!$A$5:$I$54,5,FALSE)","v":500},{"$f":"VLOOKUP($B33,Listado!$A$5:$I$54,6,FALSE)","v":0},{"$f":"Rendimientos!F13","v":500}]
[1,{"$f":"Rendimientos!A22","v":"480903T03"},{"$f":"VLOOKUP(B34,Listado!$A$5:$B$54,2,FALSE)","v":"TACO RAPIDO ALTERON 5X30 (100u)"},"ud",{"$f":"A34*Rendimientos!E22","v":2},2,{"$f":"ROUND(VLOOKUP(B34,Listado!$A$5:$I$54,9,FALSE)/Rendimientos!F22,2)","v":0.11},1,{"$f":"H34* A19","v":30},0.15,0.15,null,{"$f":"ROUNDUP(($B$14*E34)/(BC34),0)","v":1},{"$f":"VLOOKUP(B34,Listado!A:I,9,FALSE)","v":10.53},"CAJAS",{"$f":"($B$14*E34)/(BC34)","v":0.02},"CAJAS",1,{"$f":"R34*$N$34","v":10.53},{"$f":"O34","v":"CAJAS"},1,"CAJAS",10.53,30,null,null,{"$f":"U34","v":1},"CAJAS",1,"CAJAS",{"$f":"$N$34","v":10.53},30,null,null,null,null,1,"CAJAS",null,null,null,null,null,null,null,null,null,null,null,null,null,null,{"$f":"VLOOKUP($B34,Listado!$A$5:$I$54,5,FALSE)","v":0},{"$f":"VLOOKUP($B34,Listado!$A$5:$I$54,6,FALSE)","v":0},{"$f":"Rendimientos!F22","v":100},null,{"$f":"B12","v":600},4,10,"Resist"]
[6,{"$f":"VLOOKUP(C35,Listado!$B$5:$C$54,2,FALSE)","v":"0470010110"},"PASTA ATT JUNTAS 10KG 60 MIN (56)","kg",{"$f":"A35*Rendimientos!E25","v":0.66},0.66,{"$f":"ROUND(VLOOKUP(B35,Listado!$A$5:$I$54,9,FALSE)/Rendimientos!F25,2)","v":1.99},1,{"$f":"H35* A18","v":30},0.92,0.92,null,{"$f":"ROUNDUP(($B$14*E35)/(BC35),0)","v":1},{"$f":"VLOOKUP(B35,Listado!A:I,9,FALSE)","v":19.850000000000001},"SACOS",{"$f":"($B$14*E35)/(BC35)","v":6.6000000000000003E-2},"SACOS",1,{"$f":"R35*$N$35","v":19.850000000000001},"SACOS",1,"SACOS",19.850000000000001,30,null,null,{"$f":"U35","v":1},"SACOS",1,"SACOS",{"$f":"$N$35","v":19.850000000000001},30,null,null,null,null,1,"SACOS",null,null,null,null,null,null,null,null,null,null,null,null,null,null,{"$f":"VLOOKUP($B35,Listado!$A$5:$I$54,5,FALSE)","v":0},{"$f":"VLOOKUP($B35,Listado!$A$5:$I$54,6,FALSE)","v":0},{"$f":"Rendimientos!F25","v":10}]
[6,"48040101",{"$f":"VLOOKUP(B36,Listado!$A$5:$B$54,2,FALSE)","v":"MASILLA PARA ENCUENTROS ATT"},"mil",{"$f":"A36*Rendimientos!$E$23","v":60},{"$f":"$B$14*E36","v":60},{"$f":"VLOOKUP(B36,Listado!$A$5:$I$54,9,FALSE)","v":2.4199999999999999E-2},1,{"$f":"H36* A19","v":30},1.02,1.02,null,{"$f":"ROUNDUP(($B$14*E36)/(BC36),0)","v":1},{"$f":"VLOOKUP(B36,Listado!A:J,10,FALSE)","v":7.26},"BOTES",{"$f":"($B$14*E36)/(BC36)","v":0.2},{"$f":"O36","v":"BOTES"},1,{"$f":"R36*$N$36","v":7.26},{"$f":"O36","v":"BOTES"},1,{"$f":"T36","v":"BOTES"},7.26,30,null,null,{"$f":"U36","v":1},{"$f":"V36","v":"BOTES"},1,"BOTES",{"$f":"$N$36","v":7.26},30,null,null,null,null,1,{"$f":"AD36","v":"BOTES"},null,null,null,null,null,null,null,null,null,null,null,null,null,null,{"$f":"VLOOKUP($B36,Listado!$A$5:$I$54,5,FALSE)","v":0},{"$f":"VLOOKUP($B36,Listado!$A$5:$I$54,6,FALSE)","v":0},300]
[1,{"$f":"IF(BE30=\"49\",\"48010348\",IF(BE30=\"74\",\"48010370\",\"48010390\"))","v":"48010348"},{"$f":"VLOOKUP(B37,Listado!$A$5:$B$54,2,FALSE)","v":"JUNTA ESTANCA ATT 50MM (30ML)"},"ml",{"$f":"A37*Rendimientos!E24","v":0.8},0.8,{"$f":"ROUND(VLOOKUP(B37,Listado!$A$5:$I$54,9,FALSE)/Rendimientos!F24,2)","v":0.55000000000000004},1,{"$f":"H37* A20","v":30},0.31,0.31,null,{"$f":"ROUNDUP(($B$14*E37)/(BC37),0)","v":1},{"$f":"VLOOKUP(B37,Listado!A:I,9,FALSE)","v":16.59},"ROLLOS",{"$f":"($B$14*E37)/(BC37)","v":2.6666666666666668E-2},"ROLLOS",1,{"$f":"R37*$N$37","v":16.59},{"$f":"O37","v":"ROLLOS"},1,"ROLLOS",16.59,30,null,null,{"$f":"U37","v":1},"ROLLOS",1,"ROLLOS",{"$f":"$N$37","v":16.59},30,null,null,null,null,1,"ROLLOS",null,null,null,null,null,null,null,null,null,null,null,null,null,null,{"$f":"VLOOKUP($B37,Listado!$A$5:$I$54,5,FALSE)","v":0},{"$f":"VLOOKUP($B37,Listado!$A$5:$I$54,6,FALSE)","v":0},{"$f":"Rendimientos!F24","v":30}]
[2,{"$f":"IF(B10=\"Q3\",\"\",Rendimientos!A27)","v":""},{"$f":"IFERROR(VLOOKUP(B38,Listado!A5:B54,2,FALSE),\"\")","v":""},{"$f":"IF(B10=\"Q3\",\"\",\"kg\")","v":""},{"$f":"IF(B10=\"Q3\",\"\",A38*Rendimientos!E27)","v":""},{"$f":"IF(B10=\"Q3\",\"\",$B$14*E38)","v":""},{"$f":"IFERROR(ROUND(VLOOKUP(B38,Listado!$A$5:$I$54,9,FALSE)/Rendimientos!F26,2),\"\")","v":""},1,{"$f":"H38* A18","v":30},{"$f":"IFERROR(ROUND(E38*G38*(1-I38/100),2),0)","v":0},{"$f":"IFERROR(J38*$B$14,0)","v":0},null,{"$f":"IFERROR(ROUNDUP(($B$14*E38)/(BC38),0),\"0\")","v":"0"},{"$f":"IFERROR(VLOOKUP(B38,Listado!$A$5:$I$54,9,FALSE),\"0\")*((100-I38)/100)","v":0},{"$f":"IF(B10=\"Q2\",\"\",\"SACOS\")","v":"SACOS"},{"$f":"IFERROR(($B$14*E38)/(BC38),\"0\")","v":"0"},{"$f":"IF(B10=\"Q2\",\"\",\"SACOS\")","v":"SACOS"},"0",{"$f":"IFERROR(R38*$N$38,\"\")","v":0},{"$f":"IF(B10=\"Q2\",\"\",\"SACOS\")","v":"SACOS"},{"$f":"M38","v":"0"},{"$f":"IF(B10=\"Q2\",\" \",\"SACOS\")","v":"SACOS"},0,{"$f":"I38","v":30},null,null,{"$f":"IF(U38=\"\",\"\",U38)","v":"0"},{"$f":"IF(B10=\"Q2\",\" \",\"SACOS\")","v":"SACOS"},{"$f":"R38","v":"0"},"SACOS",{"$f":"IFERROR($N$38,\"\")","v":0},30,null,null,null,null,{"$f":"U38","v":"0"},{"$f":"IF(B10=\"Q2\",\" \",\"SACOS\")","v":"SACOS"},null,null,null,null,null,null,null,null,null,null,null,null,null,null,{"$f":"VLOOKUP($B38,Listado!$A$5:$I$54,5,FALSE)","v":{"$error":"#N/A"}},{"$f":"VLOOKUP($B38,Listado!$A$5:$I$54,6,FALSE)","v":{"$error":"#N/A"}},{"$f":"Rendimientos!F27","v":10},null,{"$f":"BE34*100+BE30*100+BE28*6","v":64978}]
[]
[null,null,null,null,null,null,null,null,"Total material",{"$f":"SUM(J28:J38)","v":41.45000000000001},{"$f":"SUM(K28:K38)","v":41.45000000000001},null,"Total (€)",{"$f":"SUMPRODUCT(M28:M38,N28:N38)","v":229.79999999999998},null,null,null,"Total (€)",{"$f":"SUM(S28:S38)","v":715.70999999999992},null,"Total (€)",{"$f":"SUMPRODUCT(U28:U38,W28:W38)","v":229.79999999999998},null,null,null,null,null,null,"Total (€)",{"$f":"SUMPRODUCT(AC28:AC38,AE28:AE38)","v":715.70999999999992}]
["€/m2 MO"]
[{"$f":"VLOOKUP(A14,Rendimientos!B42:E47,4,FALSE)","v":15.9},"OTROS CONCEPTOS (mano de obra, aislante, etc.)",null,"UD","UD/m2","UD","€ / UD",null,"%","€/m2","€"]
[null," ","Mano de obra: Oficial 1ª","-","-","-","-",1,"-",{"$f":"H43*A42","v":15.9},{"$f":"IFERROR(J43*$B$14,\"\")","v":15.9}]
[null," "," "," "," ",{"$f":"E44*B14","v":{"$error":"#VALUE!"}}," ",1,0,null,{"$f":"IFERROR(J44*$B$14,\"\")","v":0}]
[null," "," "," "," ",{"$f":"E45*B14","v":{"$error":"#VALUE!"}}," ",1,0,null,0]
[null," "," "," "," ",null," ",null,null," "," "]
[null,null,null,null,null,null,null,null,"Total otros conceptos",{"$f":"SUM(IFERROR(J41:J45,\" \"))","v":15.9},{"$f":"K41+SUM(K43:K45)","v":15.9}]
[]
[null,null,null,null,null,null,null,null,"TOTAL ",{"$f":"J40+J47","v":57.350000000000009},{"$f":"K40+K47","v":57.350000000000009}]
[null,null,null,null,null,null,"Beneficio (%)",1,"TOTAL inc. Beneficio",{"$f":"J49*(1+G51/100)","v":68.820000000000007},{"$f":"K49*(1+G51/100)","v":68.820000000000007}]
[null,null,null,null,null,null,{"$f":"H51* A21","v":20},1]
[]
[null,{"$f":"Rendimientos!C141","v":"NOTA: Rendimientos calculados teniendo en cuenta un despedicio del 2% en las placas y del 5% en el resto del sistema."}]
[]
[]
[]
[]
[]
[]
[]
[]
[]
[]
[]
[]
[]
[]
[]
[]
[]
[]
[]
[]
[]
[]
[]
[]
[]
[]
[]
[]
[]
[]
[]
[]
[]
[]
[]
[]
[]
[]
[]
[]
[]
[]
[]
[]
[]
[]
[]
[]
[]
[]
[]
[null,"LINKS A DESPLEGABLES"]
[]
[null,"Acabado"]
[null,{"$f":"Rendimientos!B25","v":"Q2"},{"$f":"Rendimientos!C25","v":"Totalmente finalizado con nivel de acabado Q2"}]
[null,{"$f":"Rendimientos!B26","v":"Q3"},{"$f":"Rendimientos!C26","v":"Totalmente finalizado con nivel de acabado Q3"}]
[null,{"$f":"Rendimientos!B27","v":"Q4"},{"$f":"Rendimientos!C27","v":"Totalmente finalizado con nivel de acabado Q4"}]
[]
[null,"Modulación"]
[null,null,{"$f":"Rendimientos!C28","v":600}]
[null,null,{"$f":"Rendimientos!C29","v":400}]
[]
[null,"Placas"]
[null,"040113",{"$f":"VLOOKUP(B117,Listado!$A$5:$B$54,2,FALSE)","v":"PLACA ATT BASIC 13X600X1200 (78)"}]
[null,"040115",{"$f":"VLOOKUP(B118,Listado!$A$5:$B$54,2,FALSE)","v":"PLACA ATT BASIC 15X600X1200 (66)"}]
[null,"040120",{"$f":"VLOOKUP(B119,Listado!$A$5:$B$54,2,FALSE)","v":"PLACA ATT BASIC 20X600X1200 (48)"}]
[null,"040213",{"$f":"VLOOKUP(B120,Listado!$A$5:$B$54,2,FALSE)","v":"PLACA ATT HIDRO 13X600X1200 (78)"}]
[null,"040215",{"$f":"VLOOKUP(B121,Listado!$A$5:$B$54,2,FALSE)","v":"PLACA ATT HIDRO 15X600X1200 (66)"}]
[null,"040220",{"$f":"VLOOKUP(B122,Listado!$A$5:$B$54,2,FALSE)","v":"PLACA ATT HIDRO 20X600X1200 (48)"}]
[null,"040313",{"$f":"VLOOKUP(B123,Listado!$A$5:$B$54,2,FALSE)","v":"PLACA ATT FUEGO 13X600X1200 (78)"}]
[null,"040315",{"$f":"VLOOKUP(B124,Listado!$A$5:$B$54,2,FALSE)","v":"PLACA ATT FUEGO 15X600X1200 (66)"}]
[null,"040320",{"$f":"VLOOKUP(B125,Listado!$A$5:$B$54,2,FALSE)","v":"PLACA ATT FUEGO 20X600X1200 (48)"}]
[null,"040413",{"$f":"VLOOKUP(B126,Listado!$A$5:$B$54,2,FALSE)","v":"PLACA ATT RESIST 13X600X1200 (78)"}]
[null,"040415",{"$f":"VLOOKUP(B127,Listado!$A$5:$B$54,2,FALSE)","v":"PLACA ATT RESIST 15X600X1200 (66)"}]
[null,"040420",{"$f":"VLOOKUP(B128,Listado!$A$5:$B$54,2,FALSE)","v":"PLACA ATT RESIST 20X600X1200 (48)"}]
[null,"040513",{"$f":"VLOOKUP(B129,Listado!$A$5:$B$54,2,FALSE)","v":"PLACA ATT HIDROPLUS 13X600X1200 (78)"}]
[null,"040515",{"$f":"VLOOKUP(B130,Listado!$A$5:$B$54,2,FALSE)","v":"PLACA ATT HIDROPLUS 15X600X1200 (66)"}]
[null,"040520",{"$f":"VLOOKUP(B131,Listado!$A$5:$B$54,2,FALSE)","v":"PLACA ATT HIDROPLUS 20X600X1200 (48)"}]
[null,"040613",{"$f":"VLOOKUP(B132,Listado!$A$5:$B$54,2,FALSE)","v":"PLACA ATT SUPREM 13X600X1200 (78)"}]
[null,"040615",{"$f":"VLOOKUP(B133,Listado!$A$5:$B$54,2,FALSE)","v":"PLACA ATT SUPREM 15X600X1200 (66)"}]
[null,"040620",{"$f":"VLOOKUP(B134,Listado!$A$5:$B$54,2,FALSE)","v":"PLACA ATT SUPREM 20X600X1200 (48)"}]
[]
[null,"Montante"]
[null,"48104925",{"$f":"VLOOKUP(B137,Listado!$A$5:$B$54,2,FALSE)","v":"MONTANTE 49X2500 (8u x 16p)"}]
[null,"48104926",{"$f":"VLOOKUP(B138,Listado!$A$5:$B$54,2,FALSE)","v":"MONTANTE 49X2600 (8u x 16p)"}]
[null,"48104927",{"$f":"VLOOKUP(B139,Listado!$A$5:$B$54,2,FALSE)","v":"MONTANTE 49X2700 (8u x 16p)"}]
[null,"48104928",{"$f":"VLOOKUP(B140,Listado!$A$5:$B$54,2,FALSE)","v":"MONTANTE 49X2800 (8u x 16p)"}]
[null,"48104930",{"$f":"VLOOKUP(B141,Listado!$A$5:$B$54,2,FALSE)","v":"MONTANTE 49X3000 (8u x 16p)"}]
[null,"48104935",{"$f":"VLOOKUP(B142,Listado!$A$5:$B$54,2,FALSE)","v":"MONTANTE 49X3500 (8u x 16p)"}]
[null,"48107426",{"$f":"VLOOKUP(B143,Listado!$A$5:$B$54,2,FALSE)","v":"MONTANTE 74X2600 (8u x 16p)"}]
[null,"48107427",{"$f":"VLOOKUP(B144,Listado!$A$5:$B$54,2,FALSE)","v":"MONTANTE 74X2700 (8u x 16p)"}]
[null,"48107430",{"$f":"VLOOKUP(B145,Listado!$A$5:$B$54,2,FALSE)","v":"MONTANTE 74X3000 (8u x 12p)"}]
[null,"48109930",{"$f":"VLOOKUP(B146,Listado!$A$5:$B$54,2,FALSE)","v":"MONTANTE 99X3000 (8u x 16p)"}]
[]
[null,"Pasta de juntas"]
[null,"0470010110",{"$f":"VLOOKUP(B149,Listado!$A$5:$B$54,2,FALSE)","v":"PASTA ATT JUNTAS 10KG 60 MIN (56)"}]
[null,"0470010210",{"$f":"VLOOKUP(B150,Listado!$A$5:$B$54,2,FALSE)","v":"PASTA ATT JUNTAS 10KG 30 MIN (56)"}]
[null,"0470010310",{"$f":"VLOOKUP(B151,Listado!$A$5:$B$54,2,FALSE)","v":"PASTA ATT JUNTAS 10KG 300 MIN (56)"}]
[null,"0470010111",{"$f":"VLOOKUP(B152,Listado!$A$5:$B$54,2,FALSE)","v":"PASTA ATT JUNTAS H 10KG 60 MIN (56) "}]
[null,"0470010511",{"$f":"VLOOKUP(B153,Listado!$A$5:$B$54,2,FALSE)","v":"PASTA ATT JUNTAS H 10KG 300 MIN (56) "}]

{"sheet":"Tabique mixto","index":9,"n_rows":152,"n_cols":60,"rows_kept":152,"cut":false,"hidden":false,"merged":[[27,59,28,59],[25,52,25,55],[25,56,26,56],[38,14,38,16],[38,38,39,42],[48,8,49,8],[48,9,49,9],[48,10,49,10],[6,2,6,51],[25,12,25,14],[25,15,25,16],[25,17,25,19],[25,20,25,21],[25,24,25,27],[25,28,25,29],[25,36,25,37],[25,38,25,39]]}
[null,null,"                     RENDIMIENTOS"]
[null,null,"                     PEDIDO MATERIALES"]
[null,null,"                     PRESUPUESTO"]
[null,null,"                     LISTA DE MATERIALES"]
[null,null,null,{"$f":"VLOOKUP(BE37,'Índice sistemas'!C:E,3,FALSE)","v":"TABIQUE MIXTO ATT® 75/600 (49)  [13+49+13]"},null,null,null,null,null,null,null,null,{"$f":"$D$5","v":"TABIQUE MIXTO ATT® 75/600 (49)  [13+49+13]"},null,null,null,null,null,null,null,{"$f":"$D$5","v":"TABIQUE MIXTO ATT® 75/600 (49)  [13+49+13]"},null,null,null,null,null,null,null,{"$f":"$D$5","v":"TABIQUE MIXTO ATT® 75/600 (49)  [13+49+13]"},null,null,null,null,null,null,null,{"$f":"AC5","v":"TABIQUE MIXTO ATT® 75/600 (49)  [13+49+13]"},null,null,null,null,null,null,null,{"$f":"AK5","v":"TABIQUE MIXTO ATT® 75/600 (49)  [13+49+13]"}]
[]
[null,null,{"$f":"VLOOKUP(BE37,'Índice sistemas'!C:N,(BE30+6),FALSE)","v":"Tabique mixto formado por una placa BASIC de 13 mm de espesor compuesta por yeso natural, fibra de vidrio y aditivos inorgánicos que le aportan alta dureza y resistencia mecánica. Al otro lado, incorpora una placa HIDRO de 13 mm con tratamiento hidrófugo, disminuyendo así su capacidad de absorción de agua (menor al 5%). Idónea para proteger las estancias de los efectos adversos de la humedad. Reacción al fuego: EUROCLASE A1. Sistema de galces desiguales: las placas encajan entre ellas dejando una entrecalle de 3 mm por donde se inserta la pasta de juntas. Este sistema no utiliza cinta de papel. La pasta de juntas se aplica en las cavidades de las placas y una masilla elástica en los encuentros. Atornillada a cada lado de una estructura metálica de acero galvanizado formada por canales de 50 mm y montantes de 51x49x49 mm con una modulación de 600 mm entre ejes, dando un ancho total de tabique de 75 mm. Incluida parte proporcional del resto de materiales: tornillería, pasta de juntas, masilla para encuentros perimetrales, fijaciones, junta estanca, etc. Montaje según norma de instalación UNE 102043 y exigencias del CTE."}]
[{"$f":"Datos!A15","v":"clientes@elalteron.com"},null,{"$f":"IF(B10=B107,C107,IF(B10=B108,C108,C109))","v":"Totalmente finalizado con nivel de acabado Q3"}]
["CODIFICACIÓN MANO OBRA"]
[{"$f":"IF(B10=\"Q2\",2,IF(B10=\"Q3\",3,4))","v":3},"Q3","INTRODUCIR ACABADO DESEADO"]
[]
[{"$f":"B12/10","v":60},600,"INTRODUCIR MODULACIÓN "]
[]
[{"$f":"SUM(A10:A13)","v":63},1,"INTRODUCIR CANTIDAD m2"]
["PESTAÑA DATOS"]
[{"$f":"Datos!A6","v":30}]
[{"$f":"Datos!A7","v":30}]
[{"$f":"Datos!A8","v":30}]
[{"$f":"Datos!A9","v":30},null,"Material calculado para ",null,null,null,null,null,null,null,null,null,null,null,null,null,null,null,null,null,{"$f":"B14","v":1},"m2",null,null,null,null,null,null,{"$f":"B14","v":1},"m2"]
[{"$f":"Datos!A10","v":30}]
[{"$f":"Datos!A11","v":20}]
[{"$f":"Datos!A12","v":"pedidos@elalteron.com"}]
[{"$f":"Datos!A13","v":"repuesto@elalteron.com"},null,null,null,null,null,null,null,null,null,null,null,null,null,null,null,null,null,null,null,null,null,null,null,null,null,null,null,null,null,null,null,null,null,null,null,null,null,null,null,null,null,null,null,"Precio",{"$f":"AS5","v":"TABIQUE MIXTO ATT® 75/600 (49)  [13+49+13]"},null,null,null,null,53.112000000000002,"€/m2"]
[{"$f":"Datos!A14","v":"compras@elalteron.com"},null,null,null,null,null,null,null,null,null,null,null,null,null,null,null,null,null,null,null,null,null,null,null,null,null,null,null,null,null,null,null,null,null,null,null,null,null,null,null,null,null,null,null,"Cantidad de sistema",null,null,null,null,null,1,"m2"]
[{"$f":"IF(B10=\"Q2\",0,'Tabique mixto'!A18)","v":30},null,null,null,null,null,null,null,null,null,null,null,null,null,null,null,null,null,null,null,null,null,null,null,null,null,null,null,null,null,null,null,null,null,null,null,null,null,null,null,null,null,null,null,"TOTAL",null,null,null,null,null,{"$f":"AY23*AY24","v":53.112000000000002},"€"]
["MULTIPLICADOR",null,null,"UD de MEDIDA","RENDIMIENTO","CANTIDAD","CANTIDAD",null,"DESCUENTO","REPERCUSIÓN"," TOTAL",null,"TOTAL PIEZAS",null,null,"DESGLOSE",null,"REDONDEADO ",null,null,"TOTAL PIEZAS",null,"PRECIO","DESCUENTO","DESGLOSE EN PIEZAS",null,null,null,"REDONDEADO ",null,"PRECIO","DESCUENTO",null,null,null,null,"TOTAL PIEZAS",null,"DESGLOSE",null,null,null,null,null,null,null,null,null,null,null,null,null,"DATOS DE LISTADO Y RENDIMIENTOS",null,null,null,"SISTEMA"]
["TRASDOSADO","CÓDIGO","MATERIALES","UD","UD/m2","UD","€ / UD",1,"%","€/m2","€",null,"CANTIDAD","€/UD","UD","PAQ/PAL","PIEZAS","CANTIDAD","€","UD","CANTIDAD","UD","€/UD","%",null,null,null,null,"CANTIDAD","UD","€/UD","%",null,null,null,null,"CANTIDAD","UD","PAQ/PAL","PIEZAS",null,null,null,null,null,null,null,null,null,null,null,null,"ALTO","LARGO","UNI.CAJA","CAJAS/PALE"]
[1,{"$f":"VLOOKUP(C28,Listado!$B$4:$D$30,2,FALSE)","v":"040213"},"PLACA ATT HIDRO 13X600X1200 (78)","m2",{"$f":"A28*Rendimientos!E6","v":1.02},{"$f":"$B$14*E28","v":1.02},{"$f":"VLOOKUP(B28,Listado!$A$5:$I$54,9,FALSE)","v":11.19},1,{"$f":"H28* A16","v":30},{"$f":"ROUND(E28*G28*(1-I28/100),2)","v":7.99},{"$f":"J28*$B$14","v":7.99},null,{"$f":"ROUNDUP(($B$14*E28)/(BA28*BB28),0)","v":2},{"$f":"(ROUND(VLOOKUP(B28,Listado!A:I,9,FALSE)*(BA28*BB28),2))","v":8.06},"PLACAS",{"$f":"INT(M28/($BC$28*$BD$28))","v":0},{"$f":"M28-P28*$BC$28*$BD$28","v":2},{"$f":"ROUNDUP(($B$14*E28)/(BA28*BB28*BC28*BD28),0)","v":1},{"$f":"$N$28*R28*$BD$28","v":628.68000000000006},"PALETS",{"$f":"M28","v":2},"PLACAS",{"$f":"N28","v":8.06},{"$f":"I28","v":30},{"$f":"INT(U28/($BC$28*$BD$28))","v":0},"PALETS",{"$f":"U28-Y28*$BC$28*$BD$28","v":2},"PLACAS",{"$f":"R28","v":1},{"$f":"T28","v":"PALETS"},{"$f":"$N$28*$BD$28","v":628.68000000000006},{"$f":"X28","v":30},null,null,null,null,{"$f":"U28","v":2},"PLACAS",{"$f":"INT(AK28/($BC$28*$BD$28))","v":0},{"$f":"AK28-AM28*$BC$28*$BD$28","v":2},null,null,null,null,null,null,null,null,null,null,null,null,{"$f":"VLOOKUP($B28,Listado!$A$5:$I$54,5,FALSE)","v":0.6},{"$f":"VLOOKUP($B28,Listado!$A$5:$I$54,6,FALSE)","v":1.2},{"$f":"VLOOKUP($B28,Listado!$A$5:$I$54,7,FALSE)","v":1},{"$f":"VLOOKUP($B28,Listado!$A$5:$I$54,8,FALSE)","v":78},{"$f":"RIGHT(B28,2)","v":"13"},"Id tipo placa ","Id columnas","Tipo"]
[1,{"$f":"IF(BE28=\"13\",\"040113\",IF(BE28=\"15\",\"040115\",IF(BE28=\"20\",\"040120\",3)))","v":"040113"},{"$f":"VLOOKUP(B29,Listado!$A$5:$B$54,2,FALSE)","v":"PLACA ATT BASIC 13X600X1200 (78)"},"m2",{"$f":"A29*Rendimientos!E6","v":1.02},{"$f":"$B$14*E29","v":1.02},{"$f":"VLOOKUP(B29,Listado!$A$5:$I$54,9,FALSE)","v":6.36},1,{"$f":"H29* A16","v":30},{"$f":"ROUND(E29*G29*(1-I29/100),2)","v":4.54},{"$f":"J29*$B$14","v":4.54},null,{"$f":"ROUNDUP(($B$14*E29)/(BA29*BB29),0)","v":2},{"$f":"(ROUND(VLOOKUP(B29,Listado!A:I,9,FALSE)*(BA29*BB29),2))","v":4.58},"PLACAS",{"$f":"INT(M29/($BC$28*$BD$28))","v":0},{"$f":"M29-P29*$BC$28*$BD$28","v":2},{"$f":"ROUNDUP(($B$14*E29)/(BA29*BB29*BC29*BD29),0)","v":1},{"$f":"$N$29*R29*$BD$29","v":357.24},"PALETS",{"$f":"M29","v":2},"PLACAS",{"$f":"N29","v":4.58},{"$f":"I29","v":30},{"$f":"INT(U29/($BC$28*$BD$28))","v":0},"PALETS",{"$f":"U29-Y29*$BC$29*$BD$29","v":2},"PLACAS",{"$f":"R29","v":1},{"$f":"T29","v":"PALETS"},{"$f":"$N$29*$BD$29","v":357.24},{"$f":"X29","v":30},null,null,null,null,{"$f":"U29","v":2},"PLACAS",{"$f":"INT(AK29/($BC$29*$BD$29))","v":0},{"$f":"AK29-AM29*$BC$28*$BD$28","v":2},null,null,null,null,null,null,null,null,null,null,null,null,{"$f":"VLOOKUP($B29,Listado!$A$5:$I$54,5,FALSE)","v":0.6},{"$f":"VLOOKUP($B29,Listado!$A$5:$I$54,6,FALSE)","v":1.2},{"$f":"VLOOKUP($B29,Listado!$A$5:$I$54,7,FALSE)","v":1},{"$f":"VLOOKUP($B29,Listado!$A$5:$I$54,8,FALSE)","v":78},{"$f":"RIGHT(B29,2)","v":"13"},"en código alt","hoja \"Sistema\""]
[1,{"$f":"IF(BE31=\"49\",48115030,IF(BE31=\"74\",\"48117530\",\"481110030\"))","v":48115030},{"$f":"VLOOKUP(B30,Listado!$A$5:$B$54,2,FALSE)","v":"CANAL 50X3000 (8u x 16p)"},"ml",{"$f":"A30*Rendimientos!E7","v":0.8},{"$f":"$B$14*E30","v":0.8},{"$f":"VLOOKUP(B30,Listado!$A$5:$I$54,9,FALSE)","v":3.55},1,{"$f":"H30* A17","v":30},{"$f":"ROUND(E30*G30*(1-I30/100),2)","v":1.99},1.99,null,{"$f":"ROUNDUP(($B$14*E30)/(BB30),0)","v":1},{"$f":"(ROUND(VLOOKUP(B30,Listado!A:I,9,FALSE)*BB30,2))","v":10.65},"PERFILES",{"$f":"INT(M30/$BC$30)","v":0},{"$f":"M30-P30*$BC$30","v":1},{"$f":"ROUNDUP(($B$14*E30)/(BB30*BC30),0)","v":1},{"$f":"R30*$BC$30*$N$30","v":85.2},"PAQUETES",{"$f":"M30","v":1},"PERFILES",10.65,{"$f":"I30","v":30},{"$f":"INT(U30/$BC$30)","v":0},"PAQUETES",{"$f":"U30-Y30*$BC$30","v":1},"PERFILES",{"$f":"R30","v":1},"PAQUETES",{"$f":"$BC$30*$N$30","v":85.2},{"$f":"X30","v":30},null,null,null,null,{"$f":"U30","v":1},"PERFILES",{"$f":"INT(AK30/$BC$30)","v":0},{"$f":"AK30-AM30*$BC$30","v":1},null,null,null,null,null,null,null,null,null,null,null,null,{"$f":"VLOOKUP($B30,Listado!$A$5:$I$54,5,FALSE)","v":0},{"$f":"VLOOKUP($B30,Listado!$A$5:$I$54,6,FALSE)","v":3},{"$f":"VLOOKUP($B30,Listado!$A$5:$I$54,7,FALSE)","v":8},{"$f":"VLOOKUP($B30,Listado!$A$5:$I$54,8,FALSE)","v":16},{"$f":"LEFT(RIGHT(B28,3),1)","v":"2"},1,7,"Basic"]
[1,{"$f":"VLOOKUP(C31,Listado!$B$5:$C$54,2,FALSE)","v":"48104930"},"MONTANTE 49X3000 (8u x 16p)","ml",{"$f":"IF(B12=600,A31*Rendimientos!E9,A31*Rendimientos!E8)","v":2.1},{"$f":"$B$14*E31","v":2.1},{"$f":"VLOOKUP(B31,Listado!$A$5:$I$54,9,FALSE)","v":4.54},1,{"$f":"H31* A17","v":30},{"$f":"ROUND(E31*G31*(1-I31/100),2)","v":6.67},6.67,null,{"$f":"ROUNDUP(($B$14*E31)/(BB31),0)","v":1},{"$f":"ROUND(VLOOKUP(B31,Listado!A:I,9,FALSE)*BB31,2)","v":13.62},"PERFILES",{"$f":"INT(M31/$BC$31)","v":0},{"$f":"M31-P31*$BC$31","v":1},{"$f":"ROUNDUP(($B$14*E31)/(BB31*BC31),0)","v":1},{"$f":"R31*$BC$31*$N$31","v":108.96},"PAQUETES",1,"PERFILES",13.62,{"$f":"I31","v":30},{"$f":"INT(U31/$BC$31)","v":0},"PAQUETES",{"$f":"U31-Y31*$BC$31","v":1},"PERFILES",1,"PAQUETES",{"$f":"$BC$31*$N$31","v":108.96},30,null,null,null,null,{"$f":"U31","v":1},"PERFILES",{"$f":"INT(AK31/$BC$31)","v":0},{"$f":"AK31-AM31*$BC$31","v":1},null,null,null,null,null,null,null,null,null,null,null,null,{"$f":"VLOOKUP($B31,Listado!$A$5:$I$54,5,FALSE)","v":0},{"$f":"VLOOKUP($B31,Listado!$A$5:$I$54,6,FALSE)","v":3},{"$f":"VLOOKUP($B31,Listado!$A$5:$I$54,7,FALSE)","v":8},{"$f":"VLOOKUP($B31,Listado!$A$5:$I$54,8,FALSE)","v":16},{"$f":"LEFT(RIGHT(B31,4),2)","v":"49"},2,8,"Hidro"]
[2,{"$f":"IF(BE28=\"20\",\"4802010135\",\"4802010125\")","v":"4802010125"},{"$f":"VLOOKUP(B32,Listado!$A$5:$B$54,2,FALSE)","v":"TORNILLOS ATT PP 3,5X25 (1000)"},"ud",{"$f":"IF(B12=600,A32*Rendimientos!E16,A32*Rendimientos!E10)","v":28},28,{"$f":"ROUND(VLOOKUP(B32,Listado!$A$5:$I$54,9,FALSE)/BA32,2)","v":0.03},1,{"$f":"H32* A19","v":30},0.59,0.59,null,{"$f":"ROUNDUP(($B$14*E32)/(BC32),0)","v":1},{"$f":"VLOOKUP(B32,Listado!A:I,9,FALSE)","v":29.06},"CAJAS",{"$f":"($B$14*E32)/(BC32)","v":2.8000000000000001E-2},"CAJAS",{"$f":"M32","v":1},{"$f":"R32*$N$32","v":29.06},{"$f":"O32","v":"CAJAS"},1,"CAJAS",29.06,30,null,null,{"$f":"U32","v":1},"CAJAS",1,"CAJAS",{"$f":"$N$32","v":29.06},30,null,null,null,null,1,"CAJAS",null,null,null,null,null,null,null,null,null,null,null,null,null,null,{"$f":"VLOOKUP($B32,Listado!$A$5:$I$54,5,FALSE)","v":1000},{"$f":"VLOOKUP($B32,Listado!$A$5:$I$54,6,FALSE)","v":0},{"$f":"Rendimientos!F10","v":1000},null,{"$f":"IF(BE30=\"1\",1,IF(BE30=\"2\",2,IF(BE30=\"3\",3,IF(BE30=\"4\",4,IF(BE30=\"5\",5,6)))))","v":2},3,9,"Fuego"]
[1,{"$f":"Rendimientos!A22","v":"480903T03"},{"$f":"VLOOKUP(B33,Listado!$A$5:$B$54,2,FALSE)","v":"TACO RAPIDO ALTERON 5X30 (100u)"},"ud",{"$f":"A33*Rendimientos!E22","v":2},2,{"$f":"ROUND(VLOOKUP(B33,Listado!$A$5:$I$54,9,FALSE)/Rendimientos!F22,2)","v":0.11},1,{"$f":"H33* A19","v":30},0.15,0.15,null,{"$f":"ROUNDUP(($B$14*E33)/(BC33),0)","v":1},{"$f":"VLOOKUP(B33,Listado!A:I,9,FALSE)","v":10.53},"CAJAS",{"$f":"($B$14*E33)/(BC33)","v":0.02},"CAJAS",1,{"$f":"R33*$N$33","v":10.53},{"$f":"O33","v":"CAJAS"},1,"CAJAS",10.53,30,null,null,{"$f":"U33","v":1},"CAJAS",1,"CAJAS",{"$f":"$N$33","v":10.53},30,null,null,null,null,1,"CAJAS",null,null,null,null,null,null,null,null,null,null,null,null,null,null,{"$f":"VLOOKUP($B33,Listado!$A$5:$I$54,5,FALSE)","v":0},{"$f":"VLOOKUP($B33,Listado!$A$5:$I$54,6,FALSE)","v":0},{"$f":"Rendimientos!F22","v":100},null,{"$f":"B12","v":600},4,10,"Resist"]
[2,{"$f":"VLOOKUP(C34,Listado!$B$5:$C$54,2,FALSE)","v":"0470010110"},"PASTA ATT JUNTAS 10KG 60 MIN (56)","kg",{"$f":"A34*Rendimientos!E25","v":0.22},0.22,{"$f":"ROUND(VLOOKUP(B34,Listado!$A$5:$I$54,9,FALSE)/Rendimientos!F25,2)","v":1.99},1,{"$f":"H34* A18","v":30},0.31,0.31,null,{"$f":"ROUNDUP(($B$14*E34)/(BC34),0)","v":1},{"$f":"VLOOKUP(B34,Listado!A:I,9,FALSE)","v":19.850000000000001},"SACOS",{"$f":"($B$14*E34)/(BC34)","v":2.1999999999999999E-2},"SACOS",1,{"$f":"R34*$N$34","v":19.850000000000001},"SACOS",1,"SACOS",19.850000000000001,30,null,null,{"$f":"U34","v":1},"SACOS",1,"SACOS",{"$f":"$N$34","v":19.850000000000001},30,null,null,null,null,1,"SACOS",null,null,null,null,null,null,null,null,null,null,null,null,null,null,{"$f":"VLOOKUP($B34,Listado!$A$5:$I$54,5,FALSE)","v":0},{"$f":"VLOOKUP($B34,Listado!$A$5:$I$54,6,FALSE)","v":0},{"$f":"Rendimientos!F25","v":10},null,null,5,11,"Hidroplus"]
[2,"48040101",{"$f":"VLOOKUP(B35,Listado!$A$5:$B$54,2,FALSE)","v":"MASILLA PARA ENCUENTROS ATT"},"mil",{"$f":"A35*Rendimientos!$E$23","v":20},{"$f":"$B$14*E35","v":20},{"$f":"VLOOKUP(B35,Listado!$A$5:$I$54,9,FALSE)","v":2.4199999999999999E-2},1,{"$f":"H35* A19","v":30},0.34,0.34,null,{"$f":"ROUNDUP(($B$14*E35)/(BC35),0)","v":1},{"$f":"VLOOKUP(B35,Listado!A:J,10,FALSE)","v":7.26},"BOTES",{"$f":"($B$14*E35)/(BC35)","v":6.6666666666666666E-2},{"$f":"O35","v":"BOTES"},1,{"$f":"R35*$N$35","v":7.26},{"$f":"O35","v":"BOTES"},1,{"$f":"T35","v":"BOTES"},7.26,30,null,null,{"$f":"U35","v":1},{"$f":"V35","v":"BOTES"},1,"BOTES",{"$f":"$N$35","v":7.26},30,null,null,null,null,1,{"$f":"AD35","v":"BOTES"},null,null,null,null,null,null,null,null,null,null,null,null,null,null,{"$f":"VLOOKUP($B35,Listado!$A$5:$I$54,5,FALSE)","v":0},{"$f":"VLOOKUP($B35,Listado!$A$5:$I$54,6,FALSE)","v":0},{"$f":"Rendimientos!F23","v":300},null,null,6,12,"Suprem"]
[1,{"$f":"IF(BE31=\"49\",\"48010348\",IF(BE31=\"74\",\"48010370\",\"48010390\"))","v":"48010348"},{"$f":"VLOOKUP(B36,Listado!$A$5:$B$54,2,FALSE)","v":"JUNTA ESTANCA ATT 50MM (30ML)"},"ml",{"$f":"A36*Rendimientos!E24","v":0.8},0.8,{"$f":"ROUND(VLOOKUP(B36,Listado!$A$5:$I$54,9,FALSE)/Rendimientos!F24,2)","v":0.55000000000000004},1,{"$f":"H36* A20","v":30},0.31,0.31,null,{"$f":"ROUNDUP(($B$14*E36)/(BC36),0)","v":1},{"$f":"VLOOKUP(B36,Listado!A:I,9,FALSE)","v":16.59},"ROLLOS",{"$f":"($B$14*E36)/(BC36)","v":2.6666666666666668E-2},"ROLLOS",1,{"$f":"R36*$N$36","v":16.59},{"$f":"O36","v":"ROLLOS"},1,"ROLLOS",16.59,30,null,null,{"$f":"U36","v":1},"ROLLOS",1,"ROLLOS",{"$f":"$N$36","v":16.59},30,null,null,null,null,1,"ROLLOS",null,null,null,null,null,null,null,null,null,null,null,null,null,null,{"$f":"VLOOKUP($B36,Listado!$A$5:$I$54,5,FALSE)","v":0},{"$f":"VLOOKUP($B36,Listado!$A$5:$I$54,6,FALSE)","v":0},{"$f":"Rendimientos!F24","v":30}]
[2,{"$f":"IF(A10=3,\"\",Rendimientos!A27)","v":""},{"$f":"IFERROR(VLOOKUP(B37,Listado!A5:B54,2,FALSE),\"\")","v":""},{"$f":"IF(B10=\"Q3\",\"\",\"kg\")","v":""},{"$f":"IF(B10=\"Q3\",\"\",IF(B10=\"Q3\",A37*Rendimientos!E26,IF(B10=\"Q4\",A37*Rendimientos!E27)))","v":""},{"$f":"IF(B10=\"Q3\",\"\",$B$14*E37)","v":""},{"$f":"IFERROR(ROUND(VLOOKUP(B37,Listado!$A$5:$I$54,9,FALSE)/Rendimientos!F26,2),\"\")","v":""},1,{"$f":"H37* A18","v":30},{"$f":"IFERROR(ROUND(E37*G37*(1-I37/100),2),0)","v":0},{"$f":"IFERROR(J37*$B$14,0)","v":0},null,{"$f":"IFERROR(ROUNDUP(($B$14*E37)/(BC37),0),\"0\")","v":"0"},{"$f":"IFERROR(VLOOKUP(B37,Listado!$A$5:$I$54,9,FALSE),\"0\")","v":"0"},{"$f":"IF(B10=\"Q2\",\"\",\"SACOS\")","v":"SACOS"},{"$f":"IFERROR(($B$14*E37)/(BC37),\"0\")","v":"0"},{"$f":"IF(B10=\"Q2\",\"\",\"SACOS\")","v":"SACOS"},"0",{"$f":"IFERROR(R37*$N$37,\"\")","v":0},{"$f":"IF(B10=\"Q2\",\"\",\"SACOS\")","v":"SACOS"},{"$f":"M37","v":"0"},{"$f":"IF(B10=\"Q2\",\" \",\"SACOS\")","v":"SACOS"},"0",{"$f":"I37","v":30},null,null,{"$f":"IF(U37=\"\",\"\",U37)","v":"0"},{"$f":"IF(B10=\"Q2\",\" \",\"SACOS\")","v":"SACOS"},{"$f":"R37","v":"0"},"SACOS",{"$f":"IFERROR($N$37,\"\")","v":"0"},30,null,null,null,null,{"$f":"U37","v":"0"},{"$f":"IF(B10=\"Q2\",\" \",\"SACOS\")","v":"SACOS"},null,null,null,null,null,null,null,null,null,null,null,null,null,null,{"$f":"VLOOKUP($B37,Listado!$A$5:$I$54,5,FALSE)","v":{"$error":"#N/A"}},{"$f":"VLOOKUP($B37,Listado!$A$5:$I$54,8,FALSE)","v":{"$error":"#N/A"}},{"$f":"Rendimientos!F27","v":10},null,{"$f":"BE33*100+BE31*100+BE28*5","v":64965}]
[]
[null,null,null,null,null,null,null,null,"Total material",{"$f":"SUM(J28:J37)","v":22.889999999999997},{"$f":"SUM(K28:K37)","v":22.889999999999997},null,"Total (€)",{"$f":"M28*N28+M30*N30+M31*N31+M32*N32+M33*N33+M34*N34+M35*N35+M36*N36+M37*N37","v":123.68000000000002},null,null,null,"Total (€)",{"$f":"SUM(S28:S37)","v":1263.3699999999999},null,"Total (€)",{"$f":"SUMPRODUCT(U28:U37,W28:W37)","v":132.84},null,null,null,null,null,null,"Total (€)",{"$f":"SUMPRODUCT(AC28:AC37,AE28:AE37)","v":1263.3699999999999},null,null,null,null,null,null,"Total (€)"]
["€/m2 MO"]
[{"$f":"VLOOKUP(A14,Rendimientos!B30:E35,4,FALSE)","v":8.6999999999999993},"OTROS CONCEPTOS (mano de obra, aislante, etc.)",null,"UD","UD/m2","UD","€ / UD",null,"%","€/m2","€"]
[null," ","Mano de obra: Oficial 1ª","-","-","-","-",1,"-",{"$f":"H42*A41","v":8.6999999999999993},{"$f":"IFERROR(J42*$B$14,\"\")","v":8.6999999999999993}]
[null," "," "," "," ",{"$f":"E43*B14","v":{"$error":"#VALUE!"}}," ",1,0,null,{"$f":"IFERROR(J43*$B$14,\"\")","v":0}]
[null," "," "," "," ",{"$f":"E44*B14","v":{"$error":"#VALUE!"}}," ",1,0,null,0]
[null," ",null,null,null,null,null,null,null,null," "]
[null," "," "," "," ",null,null,null,"Total otros conceptos",{"$f":"SUM(IFERROR(J40:J44,\" \"))","v":8.6999999999999993},{"$f":"K40+SUM(K42:K44)","v":8.6999999999999993}]
[null," "," "," "," "]
[null,null,null,null,null,null,null,null,"TOTAL ",{"$f":"J39+J46","v":31.589999999999996},{"$f":"K39+K46","v":31.589999999999996}]
[null,null,null,null,null,null,"Beneficio (%)",1,"TOTAL inc. Beneficio",{"$f":"J48*(1+G50/100)","v":37.907999999999994},{"$f":"K48*(1+G50/100)","v":37.907999999999994}]
[null,null,null,null,null,null,{"$f":"H50* A21","v":20},1]
[]
[null,{"$f":"Rendimientos!C141","v":"NOTA: Rendimientos calculados teniendo en cuenta un despedicio del 2% en las placas y del 5% en el resto del sistema."}]
[]
[]
[]
[]
[]
[]
[]
[]
[]
[]
[]
[]
[]
[]
[]
[]
[]
[]
[]
[]
[]
[]
[]
[]
[]
[]
[]
[]
[]
[]
[]
[]
[]
[]
[]
[]
[]
[]
[]
[]
[]
[]
[]
[]
[]
[]
[]
[]
[]
[]
[]
[null,"LINKS A DESPLEGABLES"]
[]
[null,"Acabado"]
[]
[null,{"$f":"Rendimientos!B26","v":"Q3"},{"$f":"Rendimientos!C26","v":"Totalmente finalizado con nivel de acabado Q3"}]
[null,{"$f":"Rendimientos!B27","v":"Q4"},{"$f":"Rendimientos!C27","v":"Totalmente finalizado con nivel de acabado Q4"}]
[]
[null,"Modulación"]
[null,null,{"$f":"Rendimientos!C28","v":600}]
[null,null,{"$f":"Rendimientos!C29","v":400}]
[]
[null,"Placas"]
[null,"040113",{"$f":"VLOOKUP(B116,Listado!$A$5:$B$54,2,FALSE)","v":"PLACA ATT BASIC 13X600X1200 (78)"}]
[null,"040115",{"$f":"VLOOKUP(B117,Listado!$A$5:$B$54,2,FALSE)","v":"PLACA ATT BASIC 15X600X1200 (66)"}]
[null,"040120",{"$f":"VLOOKUP(B118,Listado!$A$5:$B$54,2,FALSE)","v":"PLACA ATT BASIC 20X600X1200 (48)"}]
[null,"040213",{"$f":"VLOOKUP(B119,Listado!$A$5:$B$54,2,FALSE)","v":"PLACA ATT HIDRO 13X600X1200 (78)"}]
[null,"040215",{"$f":"VLOOKUP(B120,Listado!$A$5:$B$54,2,FALSE)","v":"PLACA ATT HIDRO 15X600X1200 (66)"}]
[null,"040220",{"$f":"VLOOKUP(B121,Listado!$A$5:$B$54,2,FALSE)","v":"PLACA ATT HIDRO 20X600X1200 (48)"}]
[null,"040313",{"$f":"VLOOKUP(B122,Listado!$A$5:$B$54,2,FALSE)","v":"PLACA ATT FUEGO 13X600X1200 (78)"}]
[null,"040315",{"$f":"VLOOKUP(B123,Listado!$A$5:$B$54,2,FALSE)","v":"PLACA ATT FUEGO 15X600X1200 (66)"}]
[null,"040320",{"$f":"VLOOKUP(B124,Listado!$A$5:$B$54,2,FALSE)","v":"PLACA ATT FUEGO 20X600X1200 (48)"}]
[null,"040413",{"$f":"VLOOKUP(B125,Listado!$A$5:$B$54,2,FALSE)","v":"PLACA ATT RESIST 13X600X1200 (78)"}]
[null,"040415",{"$f":"VLOOKUP(B126,Listado!$A$5:$B$54,2,FALSE)","v":"PLACA ATT RESIST 15X600X1200 (66)"}]
[null,"040420",{"$f":"VLOOKUP(B127,Listado!$A$5:$B$54,2,FALSE)","v":"PLACA ATT RESIST 20X600X1200 (48)"}]
[null,"040513",{"$f":"VLOOKUP(B128,Listado!$A$5:$B$54,2,FALSE)","v":"PLACA ATT HIDROPLUS 13X600X1200 (78)"}]
[null,"040515",{"$f":"VLOOKUP(B129,Listado!$A$5:$B$54,2,FALSE)","v":"PLACA ATT HIDROPLUS 15X600X1200 (66)"}]
[null,"040520",{"$f":"VLOOKUP(B130,Listado!$A$5:$B$54,2,FALSE)","v":"PLACA ATT HIDROPLUS 20X600X1200 (48)"}]
[null,"040613",{"$f":"VLOOKUP(B131,Listado!$A$5:$B$54,2,FALSE)","v":"PLACA ATT SUPREM 13X600X1200 (78)"}]
[null,"040615",{"$f":"VLOOKUP(B132,Listado!$A$5:$B$54,2,FALSE)","v":"PLACA ATT SUPREM 15X600X1200 (66)"}]
[null,"040620",{"$f":"VLOOKUP(B133,Listado!$A$5:$B$54,2,FALSE)","v":"PLACA ATT SUPREM 20X600X1200 (48)"}]
[]
[null,"Montante"]
[null,"48104925",{"$f":"VLOOKUP(B136,Listado!$A$5:$B$54,2,FALSE)","v":"MONTANTE 49X2500 (8u x 16p)"}]
[null,"48104926",{"$f":"VLOOKUP(B137,Listado!$A$5:$B$54,2,FALSE)","v":"MONTANTE 49X2600 (8u x 16p)"}]
[null,"48104927",{"$f":"VLOOKUP(B138,Listado!$A$5:$B$54,2,FALSE)","v":"MONTANTE 49X2700 (8u x 16p)"}]
[null,"48104928",{"$f":"VLOOKUP(B139,Listado!$A$5:$B$54,2,FALSE)","v":"MONTANTE 49X2800 (8u x 16p)"}]
[null,"48104930",{"$f":"VLOOKUP(B140,Listado!$A$5:$B$54,2,FALSE)","v":"MONTANTE 49X3000 (8u x 16p)"}]
[null,"48104935",{"$f":"VLOOKUP(B141,Listado!$A$5:$B$54,2,FALSE)","v":"MONTANTE 49X3500 (8u x 16p)"}]
[null,"48107426",{"$f":"VLOOKUP(B142,Listado!$A$5:$B$54,2,FALSE)","v":"MONTANTE 74X2600 (8u x 16p)"}]
[null,"48107427",{"$f":"VLOOKUP(B143,Listado!$A$5:$B$54,2,FALSE)","v":"MONTANTE 74X2700 (8u x 16p)"}]
[null,"48107430",{"$f":"VLOOKUP(B144,Listado!$A$5:$B$54,2,FALSE)","v":"MONTANTE 74X3000 (8u x 12p)"}]
[null,"48109930",{"$f":"VLOOKUP(B145,Listado!$A$5:$B$54,2,FALSE)","v":"MONTANTE 99X3000 (8u x 16p)"}]
[]
[null,"Pasta de juntas"]
[null,"0470010110",{"$f":"VLOOKUP(B148,Listado!$A$5:$B$54,2,FALSE)","v":"PASTA ATT JUNTAS 10KG 60 MIN (56)"}]
[null,"0470010210",{"$f":"VLOOKUP(B149,Listado!$A$5:$B$54,2,FALSE)","v":"PASTA ATT JUNTAS 10KG 30 MIN (56)"}]
[null,"0470010310",{"$f":"VLOOKUP(B150,Listado!$A$5:$B$54,2,FALSE)","v":"PASTA ATT JUNTAS 10KG 300 MIN (56)"}]
[null,"0470010111",{"$f":"VLOOKUP(B151,Listado!$A$5:$B$54,2,FALSE)","v":"PASTA ATT JUNTAS H 10KG 60 MIN (56) "}]
[null,"0470010511",{"$f":"VLOOKUP(B152,Listado!$A$5:$B$54,2,FALSE)","v":"PASTA ATT JUNTAS H 10KG 300 MIN (56) "}]